{"text_format":"1","workbook":"xlsx","n_sheets":4,"sheets":["UserInput","Material References","KR Spec","Attenuation Plot"],"not_rendered":{"charts":5,"images":0,"macros":1,"external_links":0,"defined_names":8,"comments":0,"pivot_tables":0},"unopened":[{"sheet":"Attenuation Plot","index":3,"reason":"not_a_worksheet"}],"bounds":{"document_bytes":16777216,"sheet_cells":100000,"rows_first":2000,"rows_last":500,"rows_between":2000,"halvings":0,"cell_chars":16384,"cell_head_chars":4096},"cells_cut":0,"cells_raw":0,"read":"whole","date_system":"1900"}

{"sheet":"UserInput","index":0,"n_rows":270,"n_cols":22,"rows_kept":270,"cut":false,"hidden":false,"merged":[[0,4,0,7],[1,1,1,3],[1,7,1,9],[1,13,1,15],[2,1,2,2],[2,5,32,5],[2,7,2,8],[2,13,2,14],[3,1,3,2],[3,7,3,8],[3,13,3,14],[4,1,4,2],[4,7,4,8],[4,13,4,14],[5,1,5,2],[5,7,5,8],[5,13,5,14],[31,1,33,1],[31,7,33,7],[31,13,33,13],[5,19,5,20],[6,19,6,20],[7,19,7,20],[28,1,30,1],[28,7,30,7],[28,13,30,13]]}
[null,"Version 2.04","LOSS SNAPSHOT:","Loss at 5GHz:",{"$f":"CONCATENATE(\"     \",ROUND(U60,2),\" dB\")","v":"     0.69 dB"},null,null,null,"Loss at 12.75GHz:",{"$f":"CONCATENATE(\"     \",ROUND(U91,2),\" dB\")","v":"     1.56 dB"},null,null,null,"Loss at 14GHz:",{"$f":"CONCATENATE(\"     \",ROUND(U96,2),\" dB\")","v":"     1.69 dB"}]
[null,"Backplane/Trace Material",null,null,null,null,null,"Linecard A Material",null,null,null,null,null,"Linecard B Material"]
[null,"Length (inch)",null,1,null,{"$f":"IF(AND(J3=0,P3=0),\"no connector included\",CONCATENATE(\"2 connectors - loss at each - \",ROUND(T60,3),\"dB loss at 5G - \",ROUND(T91,3),\"dB loss at 12.75G - \",ROUND(T96,3),\"dB loss at 14G\"))","v":"no connector included"},null,"Length (inch)",null,0,null,null,null,"Length (inch)",null,0]
[null,"Trace Width (mil)",null,4,null,null,null,"Trace Width (mil)",null,null,null,null,null,"Trace Width (mil)"]
[null,"Cu Thickness (mil)",null,0.6,null,null,null,"Cu Thickness (mil)",null,null,null,null,null,"Cu Thickness (mil)"]
[null,"Diel. Thickness (mil)",null,8,null,null,null,"Diel. Thickness (mil)",null,null,null,null,null,"Diel. Thickness (mil)"]
[null,"Freq","Dk","Df",null,null,null,"Freq","Dk","Df",null,null,null,"Freq","Dk","Df"]
[null,100000000,3.6,9.1999999999999998E-3,null,null,null,100000000,null,null,null,null,null,100000000]
[null,1000000000,3.6,9.1999999999999998E-3,null,null,null,1000000000,null,null,null,null,null,1000000000]
[null,2000000000,3.5,1.15E-2,null,null,null,2000000000,null,null,null,null,null,2000000000]
[null,5000000000,3.5,1.15E-2,null,null,null,5000000000,null,null,null,null,null,5000000000]
[null,10000000000,3.4,1.2500000000000001E-2,null,null,null,10000000000,null,null,null,null,null,10000000000]
[null,20000000000,3.2,1.4E-2,null,null,null,20000000000,null,null,null,null,null,20000000000]
[null,"Medium Roughness",31,6.0000002122251317E-7]
[]
[]
[]
[]
[]
[]
[]
[]
[]
[]
[]
[]
[]
[]
[null,"DK fit to Second Order Equation","c2",{"$f":"INDEX(LINEST(C8:C13,B8:B13^{1,2}),1)","v":3.647739516599235E-23},null,null,null,"DK fit to Second Order Equation","c2",{"$f":" IF($J$3=0,\"n/a\", INDEX(LINEST(I8:I13,H8:H13^{1,2}),1))","v":"n/a"},null,null,null,"DK fit to Second Order Equation","c2",{"$f":" IF($P$3=0,\"n/a\", INDEX(LINEST(O8:O13,N8:N13^{1,2}),1) )","v":"n/a"}]
[null,null,"c1",{"$f":"INDEX(LINEST(C8:C13,B8:B13^{1,2}),1,2)","v":-2.023923483182445E-11},null,null,null,null,"c1",{"$f":" IF($J$3=0,\"n/a\", INDEX(LINEST(I8:I13,H8:H13^{1,2}),1,2))","v":"n/a"},null,null,null,null,"c1",{"$f":" IF($P$3=0,\"n/a\", INDEX(LINEST(O8:O13,N8:N13^{1,2}),1,2) )","v":"n/a"}]
[null,null,"b",{"$f":"INDEX(LINEST(C8:C13,B8:B13^{1,2}),1,3)","v":3.591963577146764},null,null,null,null,"b",{"$f":"IF($J$3=0,\"n/a\", INDEX(LINEST(I8:I13,H8:H13^{1,2}),1,3))","v":"n/a"},null,null,null,null,"b",{"$f":" IF($P$3=0,\"n/a\", INDEX(LINEST(O8:O13,N8:N13^{1,2}),1,3) )","v":"n/a"}]
[null,"Df fit to Second Order Equation","c2",{"$f":"INDEX(LINEST(D8:D13,B8:B13^{1,2}),1)","v":-1.1520908912298789E-23},null,null,null,"Df fit to Second Order Equation","c2",{"$f":" IF($J$3=0,\"n/a\", INDEX(LINEST(J8:J13,H8:H13^{1,2}),1))","v":"n/a"},null,null,null,"Df fit to Second Order Equation","c2",{"$f":" IF($P$3=0,\"n/a\", INDEX(LINEST(P8:P13,N8:N13^{1,2}),1) )","v":"n/a"}]
[null,null,"c1",{"$f":"INDEX(LINEST(D8:D13,B8:B13^{1,2}),1,2)","v":4.5443944460223389E-13},null,null,null,null,"c1",{"$f":" IF($J$3=0,\"n/a\", INDEX(LINEST(J8:J13,H8:H13^{1,2}),1,2) )","v":"n/a"},null,null,null,null,"c1",{"$f":" IF($P$3=0,\"n/a\", INDEX(LINEST(P8:P13,N8:N13^{1,2}),1,2) )","v":"n/a"}]
[null,null,"b",{"$f":"INDEX(LINEST(D8:D13,B8:B13^{1,2}),1,3)","v":9.4486756822103959E-3},null,null,null,null,"b",{"$f":" IF($J$3=0,\"n/a\", INDEX(LINEST(J8:J13,H8:H13^{1,2}),1,3) )","v":"n/a"},null,null,null,null,"b",{"$f":" IF($P$3=0,\"n/a\", INDEX(LINEST(P8:P13,N8:N13^{1,2}),1,3) )","v":"n/a"}]
["δ (m)","Zo","Dk","Df","αcond","αdiel","Ksnowballs","Zo","Dk","Df","αcond","αdiel","Ksnowballs","Zo","Dk","Df","αcond","αdiel","Ksnowballs","Conn. Loss","Atotal (dB)","Frequency (GHz)"]
[{"$f":"SQRT(1/(PI()*59600000*0.00000125663))*SQRT(1/($V36*1000000000))","v":2.06157064684109E-5},{"$f":" 94.15/( SQRT($C36)*( (($D$4/$D$6)/(1-$D$5/$D$6)) + ((((2/(1-$D$5/$D$6))*LN((1/(1-$D$5/$D$6))+1))-(((1/(1-$D$5/$D$6))-1)*LN((1/((1-$D$5/$D$6)^2))-1)))/PI() ) ) )","v":45.540222219728058},{"$f":"$D$29*(V36*10^9)^2 + $D$30*(V36*10^9) + $D$31","v":3.5917611884461853},{"$f":"$D$32*(V36*10^9)^2 + $D$33*(V36*10^9) + $D$34","v":9.4532189245655276E-3},{"$f":"IF(    1/(SQRT(PI()*(4*PI()*10^-7*0.999994)*59600000*$V36*10^9)) >= $D$5*0.0000254,                       (20*LOG(EXP(1))/2)  *  ((1/59600000)*39.3700787/($D$5*0.001)*(1/(0.001*$D$4)+1/(6*0.001*($D$6-$D$5)/2)))   *   (1/$B36),                          (20*LOG(EXP(1))/2)  *  ((SQRT(PI()*(4*PI()*10^-7*0.999994)/59600000)*SQRT($V36*10^9)*(1/(0.001*$D$4)+1/(6*0.001*($D$6-$D$5)/2))))/2  *  (1/$B36)     )","v":3.0977492761706242E-2},{"$f":" ( (20*LOG(EXP(1))/2) * 2*PI()*$V36*10^9 * $D36 *SQRT($C36) ) / (299792458*39.3700787 )","v":4.1420051653560681E-4},{"$f":"1 + ((3/2)*($C$14)*4*PI()*($D$14)^2)/(0.0000094*0.00000814)/(1+$A36/$D$14+$A36^2/2/($D$14)^2)","v":1.0043942362788143},{"$f":" IF($J$3=0,\"n/a\", 94.15/( SQRT($I36)*( (($J$4/$J$6)/(1-$J$5/$J$6)) + ((((2/(1-$J$5/$J$6))*LN((1/(1-$J$5/$J$6))+1))-(((1/(1-$J$5/$J$6))-1)*LN((1/((1-$J$5/$J$6)^2))-1)))/PI() ) ) ))","v":"n/a"},{"$f":" IF($J$3=0,\"n/a\", $J$29*(V36*10^9)^2 + $J$30*(V36*10^9) + $J$31)","v":"n/a"},{"$f":" IF($J$3=0,\"n/a\", $J$32*(V36*10^9)^2 + $J$33*(V36*10^9) + $J$34)","v":"n/a"},{"$f":" IF($J$3=0,\"n/a\", IF(    1/(SQRT(PI()*(4*PI()*10^-7*0.999994)*59600000*$V36*10^9)) >= $J$5*0.0000254,                       (20*LOG(EXP(1))/2)  *  ((1/59600000)*39.3700787/($J$5*0.001)*(1/(0.001*$J$4)+1/(6*0.001*($J$6-$J$5)/2)))   *   (1/$H36),                          (20*LOG(EXP(1))/2)  *  ((SQRT(PI()*(4*PI()*10^-7*0.999994)/59600000)*SQRT($V36*10^9)*(1/(0.001*$J$4)+1/(6*0.001*($J$6-$J$5)/2))))/2  *  (1/$H36)     ))","v":"n/a"},{"$f":" IF($J$3=0,\"n/a\", ( (20*LOG(EXP(1))/2) * 2*PI()*$V36*10^9 * $J36 *SQRT($I36) ) / (299792458*39.3700787 ))","v":"n/a"},{"$f":" IF($J$3=0,\"n/a\", 1 + ((3/2)*($I$14)*4*PI()*($J$14)^2)/(0.0000094*0.00000814)/(1+$A36/$J$14+$A36^2/2/($J$14)^2)  )","v":"n/a"},{"$f":" IF($P$3=0,\"n/a\", 94.15/( SQRT($O36)*( (($P$4/$P$6)/(1-$P$5/$P$6)) + ((((2/(1-$P$5/$P$6))*LN((1/(1-$P$5/$P$6))+1))-(((1/(1-$P$5/$P$6))-1)*LN((1/((1-$P$5/$P$6)^2))-1)))/PI() ) ) ) )","v":"n/a"},{"$f":" IF($P$3=0,\"n/a\", $P$29*(V36*10^9)^2 + $P$30*(V36*10^9) + $P$31 )","v":"n/a"},{"$f":" IF($P$3=0,\"n/a\", $P$32*(V36*10^9)^2 + $P$33*(V36*10^9) + $P$34 )","v":"n/a"},{"$f":" IF($P$3=0,\"n/a\", IF(    1/(SQRT(PI()*(4*PI()*10^-7*0.999994)*59600000*$V36*10^9)) >= $P$5*0.0000254,                       (20*LOG(EXP(1))/2)  *  ((1/59600000)*39.3700787/($P$5*0.001)*(1/(0.001*$P$4)+1/(6*0.001*($P$6-$P$5)/2)))   *   (1/$N36),                          (20*LOG(EXP(1))/2)  *  ((SQRT(PI()*(4*PI()*10^-7*0.999994)/59600000)*SQRT($V36*10^9)*(1/(0.001*$P$4)+1/(6*0.001*($P$6-$P$5)/2))))/2  *  (1/$N36)     ))","v":"n/a"},{"$f":" IF($P$3=0,\"n/a\", ( (20*LOG(EXP(1))/2) * 2*PI()*$V36*10^9 * $P36 *SQRT($O36) ) / (299792458*39.3700787 ) )","v":"n/a"},{"$f":" IF($P$3=0,\"n/a\", 1 + ((3/2)*($O$14)*4*PI()*($P$14)^2)/(0.0000094*0.00000814)/(1+$A36/$P$14+$A36^2/2/($P$14)^2) )","v":"n/a"},{"$f":"IF(AND($J$3=0, P$3=0), 0, 0.000009*SQRT($V36*1000000000)-0.000000000012*($V36*1000000000)+1.6E-21*($V36*1000000000)^2)","v":0},{"$f":"F36*$D$3 + E36*G36*$D$3    +    $T36    +   IF(OR(K36=\"n/a\",L36=\"n/a\",M36=\"n/a\"),0, (L36 + K36*M36)*$J$3)    +    $T36    +    IF(OR(Q36=\"n/a\",R36=\"n/a\",S36=\"n/a\"),0, (R36 + Q36*S36)*$P$3)","v":3.1527815700762046E-2},0.01]
[{"$f":"SQRT(1/(PI()*59600000*0.00000125663))*SQRT(1/($V37*1000000000))","v":9.2196242135097786E-6},{"$f":" 94.15/( SQRT($C37)*( (($D$4/$D$6)/(1-$D$5/$D$6)) + ((((2/(1-$D$5/$D$6))*LN((1/(1-$D$5/$D$6))+1))-(((1/(1-$D$5/$D$6))-1)*LN((1/((1-$D$5/$D$6)^2))-1)))/PI() ) ) )","v":45.545354829265989},3.5909517065986605,9.4713688521682275E-3,{"$f":"IF(    1/(SQRT(PI()*(4*PI()*10^-7*0.999994)*59600000*$V37*10^9)) >= $D$5*0.0000254,                       (20*LOG(EXP(1))/2)  *  ((1/59600000)*39.3700787/($D$5*0.001)*(1/(0.001*$D$4)+1/(6*0.001*($D$6-$D$5)/2)))   *   (1/$B37),                          (20*LOG(EXP(1))/2)  *  ((SQRT(PI()*(4*PI()*10^-7*0.999994)/59600000)*SQRT($V37*10^9)*(1/(0.001*$D$4)+1/(6*0.001*($D$6-$D$5)/2))))/2  *  (1/$B37)     )","v":2.5599942454509E-2},2.0747450181861082E-3,{"$f":"1 + ((3/2)*($C$14)*4*PI()*($D$14)^2)/(0.0000094*0.00000814)/(1+$A37/$D$14+$A37^2/2/($D$14)^2)","v":1.0204520795044691},{"$f":" IF($J$3=0,\"n/a\", 94.15/( SQRT($I37)*( (($J$4/$J$6)/(1-$J$5/$J$6)) + ((((2/(1-$J$5/$J$6))*LN((1/(1-$J$5/$J$6))+1))-(((1/(1-$J$5/$J$6))-1)*LN((1/((1-$J$5/$J$6)^2))-1)))/PI() ) ) ))","v":"n/a"},{"$f":" IF($J$3=0,\"n/a\", $J$29*(V37*10^9)^2 + $J$30*(V37*10^9) + $J$31)","v":"n/a"},{"$f":" IF($J$3=0,\"n/a\", $J$32*(V37*10^9)^2 + $J$33*(V37*10^9) + $J$34)","v":"n/a"},{"$f":" IF($J$3=0,\"n/a\", IF(    1/(SQRT(PI()*(4*PI()*10^-7*0.999994)*59600000*$V37*10^9)) >= $J$5*0.0000254,                       (20*LOG(EXP(1))/2)  *  ((1/59600000)*39.3700787/($J$5*0.001)*(1/(0.001*$J$4)+1/(6*0.001*($J$6-$J$5)/2)))   *   (1/$H37),                          (20*LOG(EXP(1))/2)  *  ((SQRT(PI()*(4*PI()*10^-7*0.999994)/59600000)*SQRT($V37*10^9)*(1/(0.001*$J$4)+1/(6*0.001*($J$6-$J$5)/2))))/2  *  (1/$H37)     ))","v":"n/a"},{"$f":" IF($J$3=0,\"n/a\", ( (20*LOG(EXP(1))/2) * 2*PI()*$V37*10^9 * $J37 *SQRT($I37) ) / (299792458*39.3700787 ))","v":"n/a"},{"$f":" IF($J$3=0,\"n/a\", 1 + ((3/2)*($I$14)*4*PI()*($J$14)^2)/(0.0000094*0.00000814)/(1+$A37/$J$14+$A37^2/2/($J$14)^2)  )","v":"n/a"},{"$f":" IF($P$3=0,\"n/a\", 94.15/( SQRT($O37)*( (($P$4/$P$6)/(1-$P$5/$P$6)) + ((((2/(1-$P$5/$P$6))*LN((1/(1-$P$5/$P$6))+1))-(((1/(1-$P$5/$P$6))-1)*LN((1/((1-$P$5/$P$6)^2))-1)))/PI() ) ) ) )","v":"n/a"},{"$f":" IF($P$3=0,\"n/a\", $P$29*(V37*10^9)^2 + $P$30*(V37*10^9) + $P$31 )","v":"n/a"},{"$f":" IF($P$3=0,\"n/a\", $P$32*(V37*10^9)^2 + $P$33*(V37*10^9) + $P$34 )","v":"n/a"},{"$f":" IF($P$3=0,\"n/a\", IF(    1/(SQRT(PI()*(4*PI()*10^-7*0.999994)*59600000*$V37*10^9)) >= $P$5*0.0000254,                       (20*LOG(EXP(1))/2)  *  ((1/59600000)*39.3700787/($P$5*0.001)*(1/(0.001*$P$4)+1/(6*0.001*($P$6-$P$5)/2)))   *   (1/$N37),                          (20*LOG(EXP(1))/2)  *  ((SQRT(PI()*(4*PI()*10^-7*0.999994)/59600000)*SQRT($V37*10^9)*(1/(0.001*$P$4)+1/(6*0.001*($P$6-$P$5)/2))))/2  *  (1/$N37)     ))","v":"n/a"},{"$f":" IF($P$3=0,\"n/a\", ( (20*LOG(EXP(1))/2) * 2*PI()*$V37*10^9 * $P37 *SQRT($O37) ) / (299792458*39.3700787 ) )","v":"n/a"},{"$f":" IF($P$3=0,\"n/a\", 1 + ((3/2)*($O$14)*4*PI()*($P$14)^2)/(0.0000094*0.00000814)/(1+$A37/$P$14+$A37^2/2/($P$14)^2) )","v":"n/a"},{"$f":"IF(AND($J$3=0, P$3=0), 0, 0.000009*SQRT($V37*1000000000)-0.000000000012*($V37*1000000000)+1.6E-21*($V37*1000000000)^2)","v":0},{"$f":"F37*$D$3 + E37*G37*$D$3    +    $T37    +   IF(OR(K37=\"n/a\",L37=\"n/a\",M37=\"n/a\"),0, (L37 + K37*M37)*$J$3)    +    $T37    +    IF(OR(Q37=\"n/a\",R37=\"n/a\",S37=\"n/a\"),0, (R37 + Q37*S37)*$P$3)","v":2.8198259531084562E-2},0.05]
[6.5192588013644541E-6,45.551771990859763,3.5899400184375332,9.4940044175814958E-3,3.6198685562529705E-2,4.1588209152277119E-3,1.0387795018148926,"n/a","n/a","n/a","n/a","n/a","n/a","n/a","n/a","n/a","n/a","n/a",{"$f":" IF($P$3=0,\"n/a\", 1 + ((3/2)*($O$14)*4*PI()*($P$14)^2)/(0.0000094*0.00000814)/(1+$A38/$P$14+$A38^2/2/($P$14)^2) )","v":"n/a"},{"$f":"IF(AND($J$3=0, P$3=0), 0, 0.000009*SQRT($V38*1000000000)-0.000000000012*($V38*1000000000)+1.6E-21*($V38*1000000000)^2)","v":0},4.1761273470226269E-2,0.1]
[5.3229525214970624E-6,45.558190708058085,3.5889285126633816,9.5165823784502043E-3,4.4327908231725922E-2,6.2521856897773311E-3,1.0558515402390038,"n/a","n/a","n/a","n/a","n/a","n/a","n/a","n/a","n/a","n/a","n/a","n/a",0,5.3055875871818363E-2,0.15]
[4.6098121067548893E-6,45.564610981304725,3.5879171892762058,9.5391027347743514E-3,5.1178247222512165E-2,8.3547973621675084E-3,1.0719745718505131,"n/a","n/a","n/a","n/a","n/a","n/a","n/a","n/a","n/a","n/a","n/a","n/a",0,6.3216577016579706E-2,0.2]
[4.1231412936821802E-6,45.571032811043565,3.5869060482760058,9.5615654865539353E-3,5.7210956625613395E-2,1.0466613974408946E-2,1.08732351094852,"n/a","n/a","n/a","n/a","n/a","n/a","n/a","n/a","n/a","n/a","n/a","n/a",0,7.2673432197294399E-2,0.25]
[2.9155011685529438E-6,45.60316532266171,3.581853079079643,9.673015177283438E-3,8.0851501714648652E-2,2.1162304120996935E-2,1.1556328364201658,"n/a","n/a","n/a","n/a","n/a","n/a","n/a","n/a","n/a","n/a","n/a","n/a",0,0.11459695437632625,0.5]
[2.380496735814268E-6,45.63533681321168,3.5768046695576765,9.783024754398904E-3,9.8952654318901795E-2,3.2081836527159069E-2,1.2141488294825644,"n/a","n/a","n/a","n/a","n/a","n/a","n/a","n/a","n/a","n/a","n/a","n/a",0,0.1522250859426465,0.75]
[2.0615706468410901E-6,{"$f":" 94.15/( SQRT($C44)*( (($D$4/$D$6)/(1-$D$5/$D$6)) + ((((2/(1-$D$5/$D$6))*LN((1/(1-$D$5/$D$6))+1))-(((1/(1-$D$5/$D$6))-1)*LN((1/((1-$D$5/$D$6)^2))-1)))/PI() ) ) )","v":45.667547338268577},3.5717608197101054,9.8915942179003315E-3,0.11418009214400107,4.3219990820984933E-2,1.2659142902112073,"n/a","n/a","n/a","n/a","n/a","n/a","n/a","n/a","n/a","n/a","n/a","n/a",0,0.18776220112370828,1]
[1.8439248427019556E-6,45.699796953458097,3.5667215295369301,9.9987235677877206E-3,0.12756713819613316,5.4571560165404348E-2,1.3125733782220028,"n/a","n/a","n/a","n/a","n/a","n/a","n/a","n/a","n/a","n/a","n/a","n/a",0,0.22201278969761595,1.25]
[1.6832653844867103E-6,45.732085714456325,3.5616867990381507,1.0104412804061075E-2,0.13964413412542753,6.6131351252307916E-2,1.3551674220657874,"n/a","n/a","n/a","n/a","n/a","n/a","n/a","n/a","n/a","n/a","n/a","n/a",0,0.25537253250167258,1.5]
[1.5584009262091684E-6,45.764413676989435,3.556656628213767,1.020866192672039E-2,0.1507263555870299,7.7894184296642438E-2,1.3944162884436029,"n/a","n/a","n/a","n/a","n/a","n/a","n/a","n/a","n/a","n/a","n/a","n/a",0,0.2880694696249394,1.75]
[1.4577505842764719E-6,45.796780896833504,3.5516310170637788,1.0311470935765669E-2,0.16101936979302064,8.9854893030481081E-2,1.4308466437774079,"n/a","n/a","n/a","n/a","n/a","n/a","n/a","n/a","n/a","n/a","n/a","n/a",0,0.32024891788197801,2]
[1.3743804312273932E-6,45.829187429814205,3.5466099655881869,1.041283983119691E-2,0.17066606639250123,0.102008324697068,1.4648595796940658,"n/a","n/a","n/a","n/a","n/a","n/a","n/a","n/a","n/a","n/a","n/a","n/a",0,0.35201014698082689,2.25]
[1.303851760272891E-6,45.861633331806573,3.5415934737869903,1.0512768613014114E-2,0.17977055670732109,0.11434934004483767,1.4967698834939238,"n/a","n/a","n/a","n/a","n/a","n/a","n/a","n/a","n/a","n/a","n/a","n/a",0,0.38342449526329248,2.5]
[1.2431738753422138E-6,45.894118658734733,3.5365815416601896,1.0611257281217279E-2,0.18841149236105817,0.12687281332140815,1.5268304832541202,"n/a","n/a","n/a","n/a","n/a","n/a","n/a","n/a","n/a","n/a","n/a","n/a",0,0.41454522325367255,2.75]
[1.190248367907134E-6,45.926643466571647,3.5315741692077847,1.0708305835806408E-2,0.19665002131894233,0.13957363226754924,1.5552484871236003,"n/a","n/a","n/a","n/a","n/a","n/a","n/a","n/a","n/a","n/a","n/a","n/a",0,0.44541328041665806,3]
[1.143553642334925E-6,45.95920781133885,3.5265713564297752,1.08039142767815E-2,0.204534805923555,0.15244669811112385,1.5821961523746839,"n/a","n/a","n/a","n/a","n/a","n/a","n/a","n/a","n/a","n/a","n/a","n/a",0,0.47606088107007527,3.25]
[1.1019558627298995E-6,45.991811749106148,3.5215731033261619,1.0898082604142554E-2,0.21210532945762273,0.16548692556100419,1.607818642683617,"n/a","n/a","n/a","n/a","n/a","n/a","n/a","n/a","n/a","n/a","n/a","n/a",0,0.50651382847552062,3.5]
[1.0645905042994124E-6,46.024455335991398,3.5165794098969441,1.0990810817889572E-2,0.21939415492995601,0.17868924280096143,1.6322396682800435,"n/a","n/a","n/a","n/a","n/a","n/a","n/a","n/a","n/a","n/a","n/a","n/a",0,0.53679308546641336,3.75]
[1.030785323420545E-6,46.057138628160168,3.511590276142122,1.1082098918022551E-2,0.22642851546517501,0.19204859148352887,1.6555656836357602,"n/a","n/a","n/a","n/a","n/a","n/a","n/a","n/a","n/a","n/a","n/a","n/a",0,0.5669158714842617,4]
[1.000008650776322E-6,46.089861681825539,3.5066057020616959,1.1171946904541492E-2,0.23323146327542291,0.20555992672383966,1.6778890745460373,"n/a","n/a","n/a","n/a","n/a","n/a","n/a","n/a","n/a","n/a","n/a","n/a",0,0.59689645079405707,4.25]
[9.7183372285098128E-7,46.122624553247739,3.5016256876556651,1.1260354777446397E-2,0.23982271835085503,0.21921821709343645,1.6992906200323707,"n/a","n/a","n/a","n/a","n/a","n/a","n/a","n/a","n/a","n/a","n/a","n/a",0,0.62674671285770955,4.5]
[9.459134857421147E-7,46.155427298733933,3.4966502329240305,1.1347322536737266E-2,0.24621930757929353,0.23301844461405627,1.7198414229829138,"n/a","n/a","n/a","n/a","n/a","n/a","n/a","n/a","n/a","n/a","n/a","n/a",0,0.65647660892709614,4.75]
[9.2196242135097782E-7,46.188269974637898,3.4916793378667914,1.1432850182414096E-2,0.25243605429249327,0.246955604751387,1.7396044444636098,"n/a","n/a","n/a","n/a","n/a","n/a","n/a","n/a","n/a","n/a","n/a","n/a",0,0.68609448674146534,5]
[8.9974319425222548E-7,46.221152637359708,3.4867130024839481,1.1516937714476889E-2,0.25848595893252918,0.26102470640879821,1.7586357375821833,"n/a","n/a","n/a","n/a","n/a","n/a","n/a","n/a","n/a","n/a","n/a","n/a",0,0.71560735145074461,5.25]
[8.790566774484391E-7,46.254075343345505,3.4817512267755006,1.1599585132925644E-2,0.26438049905886468,0.27522077192104416,1.7769854503154323,"n/a","n/a","n/a","n/a","n/a","n/a","n/a","n/a","n/a","n/a","n/a","n/a",0,0.7450210720957795,5.5]
[8.5973439092666889E-7,46.287038149087159,3.476794010741449,1.1680792437760362E-2,0.27012986865777411,0.28953883704794026,1.7946986483862633,"n/a","n/a","n/a","n/a","n/a","n/a","n/a","n/a","n/a","n/a","n/a","n/a",0,0.77434054721680634,5.75]
[8.4163269224335513E-7,46.320041111121967,3.4718413543817928,1.1760559628981043E-2,0.27574317112649038,0.30397395096801172,1.8118159963535185,"n/a","n/a","n/a","n/a","n/a","n/a","n/a","n/a","n/a","n/a","n/a","n/a",0,0.80356983930023262,6]
[8.2462825873643588E-7,46.35308428603237,3.4668932576965328,1.1838886706587686E-2,0.28122857644692228,0.31852117627211535,1.8283743258087723,"n/a","n/a","n/a","n/a","n/a","n/a","n/a","n/a","n/a","n/a","n/a","n/a",0,0.83271228513141771,6.25]
[8.0861453514560123E-7,46.386167730445649,3.4619497206856682,1.1915773670580292E-2,0.2865934503538814,0.33317558895703359,1.8444071128247232,"n/a","n/a","n/a","n/a","n/a","n/a","n/a","n/a","n/a","n/a","n/a","n/a",0,0.86177058727871159,6.5]
[7.9349891193808938E-7,46.419291501033598,3.4570107433491994,1.1991220520958861E-2,0.2918444613682119,0.3479322784190409,1.859944881816546,"n/a","n/a","n/a","n/a","n/a","n/a","n/a","n/a","n/a","n/a","n/a","n/a",0,0.89074689062735324,6.75]
[7.7920046310458419E-7,46.452455654512192,3.4520763256871265,1.2065227257723393E-2,0.29698767016377581,{"$f":" ( (20*LOG(EXP(1))/2) * 2*PI()*$V68*10^9 * $D68 *SQRT($C68) ) / (299792458*39.3700787 )","v":0.36278634744744237},1.8750155492517084,"n/a","n/a","n/a","n/a","n/a","n/a","n/a","n/a","n/a","n/a","n/a","n/a",0,0.91964284694055975,7]
[7.6564811688207954E-7,46.485660247641377,3.447146467699449,1.2137793880873887E-2,0.30202860470827675,0.37773291221808447,1.8896447178257021,"n/a","n/a","n/a","n/a","n/a","n/a","n/a","n/a","n/a","n/a","n/a","n/a",0,0.94845966973734663,7.25]
[7.5277916477692089E-7,46.518905337224602,3.4422211693861677,1.2208920390410343E-2,0.30697232385303425,0.39276710228683814,1.9038559295668795,"n/a","n/a","n/a","n/a","n/a","n/a","n/a","n/a","n/a","n/a","n/a","n/a",0,0.9771981812673618,7.5]
[7.405380373508553E-7,46.552190980108591,3.4373004307472819,1.2278606786332762E-2,0.31182347147173944,0.40788406058305315,1.9176708846705903,"n/a","n/a","n/a","n/a","n/a","n/a","n/a","n/a","n/a","n/a","n/a","n/a",0,1.0058588529813184,7.75]
[7.2887529213823596E-7,46.585517233183005,3.4323842517827918,1.2346853068641144E-2,0.31658632281126786,0.4230789434029838,1.9311096315672776,"n/a","n/a","n/a","n/a","n/a","n/a","n/a","n/a","n/a","n/a","n/a","n/a",0,1.0344418406062905,8]
[7.1774677157833733E-7,46.618884153380115,3.4274726324926976,1.2413659237335489E-2,0.32126482438234788,0.4383469204031879,1.9441907327113723,"n/a","n/a","n/a","n/a","n/a","n/a","n/a","n/a","n/a","n/a","n/a","n/a",0,1.0629470147134952,8.25]
[7.0711289820914732E-7,46.652291797674472,3.4225655728769993,1.2479025292415796E-2,0.32586262845827568,0.45368317459389573,1.9569314097718946,"n/a","n/a","n/a","n/a","n/a","n/a","n/a","n/a","n/a","n/a","n/a","n/a",0,1.0913739874947241,8.5]
[6.9693808144046689E-7,46.685740223082519,3.4176630729356963,1.2542951233882067E-2,0.33038312304712958,0.46908290233234984,1.9693476712627793,"n/a","n/a","n/a","n/a","n/a","n/a","n/a","n/a","n/a","n/a","n/a","n/a",0,1.1197221363297387,8.75]
[6.8719021561369659E-7,46.719229486662343,3.4127651326687891,1.2605437061734299E-2,0.33482945804335129,0.48454131331611822,1.9814544251345811,"n/a","n/a","n/a","n/a","n/a","n/a","n/a","n/a","n/a","n/a","n/a","n/a",0,1.1479906246215301,9]
[6.7784025319825103E-7,46.752759645513258,3.4078717520762778,1.2666482775972494E-2,0.3392045681380087,0.5000536305763762,1.9932655784317961,"n/a","n/a","n/a","n/a","n/a","n/a","n/a","n/a","n/a","n/a","n/a","n/a",0,1.1761784202926917,9.25]
[6.6886184018405404E-7,46.78633075677552,3.4029829311581623,1.2726088376596653E-2,0.34351119296597699,0.51561509047116061,2.0047941257805362,"n/a","n/a","n/a","n/a","n/a","n/a","n/a","n/a","n/a","n/a","n/a","n/a",0,1.2042843122692155,9.5]
[6.6023100323484599E-7,46.81994287762992,3.3980986699144426,1.2784253863606772E-2,0.34775189488702929,0.53122094267859421,2.0160522281935949,"n/a","n/a","n/a","n/a","n/a","n/a","n/a","n/a","n/a","n/a","n/a","n/a",0,1.2323069252241345,9.75]
[6.5192588013644549E-7,46.853596065297488,3.3932189683451188,1.2840979237002857E-2,0.35192907473210205,0.5468664501900814,2.0270512834515397,"n/a","n/a","n/a","n/a","n/a","n/a","n/a","n/a","n/a","n/a","n/a","n/a",0,1.2602447328097017,10]
[6.4392648663259992E-7,46.887290377039093,3.3883438264501904,1.2896264496784902E-2,0.35604498579252386,0.56254688930347252,2.0378019891297061,"n/a","n/a","n/a","n/a","n/a","n/a","n/a","n/a","n/a","n/a","n/a","n/a",0,1.2880960695711356,10.25]
[6.3621451398219375E-7,46.921025870155098,3.3834732442296578,1.2950109642952911E-2,0.36010174628624469,0.57825754961620179,2.0483143991841164,"n/a","n/a","n/a","n/a","n/a","n/a","n/a","n/a","n/a","n/a","n/a","n/a",0,1.3158591417056622,10.5]
[6.2877315256585849E-7,46.954802601985044,3.378607221683521,1.3002514675506881E-2,0.36410135049910808,0.59399373401839195,2.0585979748785248,"n/a","n/a","n/a","n/a","n/a","n/a","n/a","n/a","n/a","n/a","n/a","n/a",0,1.3435320368063919,10.75]
[6.2158693767110691E-7,46.988620629907189,3.3737457588117801,1.3053479594446814E-2,0.36804567876947175,0.60975075868593187,2.06866163072511,"n/a","n/a","n/a","n/a","n/a","n/a","n/a","n/a","n/a","n/a","n/a","n/a",0,1.3711127327105173,11]
[6.1464161423398521E-7,47.022480011338217,3.368888855614435,1.3103004399772713E-2,0.37193650645976023,0.62552395307352204,2.0785137760190437,"n/a","n/a","n/a","n/a","n/a","n/a","n/a","n/a","n/a","n/a","n/a","n/a",0,1.3985991055545297,11.25]
[6.0792401784353377E-7,47.056380803732871,3.3640365120914852,1.3151089091484571E-2,0.37577551203793547,0.64130865990769037,2.0881623524691948,"n/a","n/a","n/a","n/a","n/a","n/a","n/a","n/a","n/a","n/a","n/a","n/a",0,1.425988937125142,11.5]
[6.0142196974756909E-7,47.090323064583494,3.3591887282429314,1.3197733669582393E-2,0.37956428437458811,0.65710023517977967,2.0976148683610925,"n/a","n/a","n/a","n/a","n/a","n/a","n/a","n/a","n/a","n/a","n/a","n/a",0,1.4532799215827534,11.75]
[5.9512418395356701E-7,47.124306851419753,3.3543455040687733,1.3242938134066178E-2,0.38330432934682751,0.67289404813890019,2.1068784296319931,"n/a","n/a","n/a","n/a","n/a","n/a","n/a","n/a","n/a","n/a","n/a","n/a",0,1.4804696716242884,12]
[5.8902018481173989E-7,47.158332221808159,3.3495068395690111,1.3286702484935924E-2,0.38699707582787318,0.68868548128485751,2.115959768189823,"n/a","n/a","n/a","n/a","n/a","n/a","n/a","n/a","n/a","n/a","n/a","n/a",0,1.5075557241437434,12.25]
[5.8310023371058862E-7,47.192399233351772,3.3446727347436447,1.3329026722191634E-2,0.39064388113084692,0.70446993036104344,2.1248652677665829,"n/a","n/a","n/a","n/a","n/a","n/a","n/a","n/a","n/a","n/a","n/a","n/a",0,1.5345355454415177,12.5]
[5.7735526371766402E-7,47.226507943689718,3.3398431895926737,1.3369910845833307E-2,0.39424603596641206,0.72024280434730115,2.1336009875613917,"n/a","n/a","n/a","n/a","n/a","n/a","n/a","n/a","n/a","n/a","n/a","n/a",0,1.5614065360274019,12.75]
[5.7421133770625807E-7,47.245627057008384,3.3371406359739062,1.3392176913446031E-2,0.39624419972750508,0.72906885093066198,2.138420988253193,"n/a","n/a","n/a","n/a","n/a","n/a","n/a","n/a","n/a","n/a","n/a","n/a",0,1.576405764101549,12.89]
[5.6635701334031149E-7,47.294850691483418,3.3301977783139196,1.3447358752274539E-2,0.40132125081865788,0.75173552910861519,2.1505858300938483,"n/a","n/a","n/a","n/a","n/a","n/a","n/a","n/a","n/a","n/a","n/a","n/a",0,1.6148113244347599,13.25]
[5.6108846149557016E-7,47.329084844394451,3.3253819121861361,1.3483922535074098E-2,0.40479659805432239,0.76744626396094096,2.1588456347196212,"n/a","n/a","n/a","n/a","n/a","n/a","n/a","n/a","n/a","n/a","n/a","n/a",0,1.6413396326198679,13.5]
[5.5596425862340788E-7,47.363360927009602,3.320570605732748,1.3519046204259623E-2,0.40823187652085258,0.78312719186338398,2.166957058398848,"n/a","n/a","n/a","n/a","n/a","n/a","n/a","n/a","n/a","n/a","n/a","n/a",0,1.6677481381536525,13.75]
[5.5097793136494974E-7,47.397678997142542,3.3157638589537561,1.3552729759831107E-2,0.4116281045738644,0.79877378786989184,2.1749248292916326,"n/a","n/a","n/a","n/a","n/a","n/a","n/a","n/a","n/a","n/a","n/a","n/a",0,1.6940339729418421,14]
[5.4612340562330713E-7,47.432039112640695,3.3109616718491597,1.3584973201788557E-2,0.4149862560141328,0.81438154022738407,2.1827534573819682,"n/a","n/a","n/a","n/a","n/a","n/a","n/a","n/a","n/a","n/a","n/a","n/a",0,1.720194225308231,14.25]
[5.4139497545002871E-7,47.466441331384715,3.3061640444189595,1.3615776530131967E-2,0.41830726279455177,0.82994595036839225,2.1904472476795362,"n/a","n/a","n/a","n/a","n/a","n/a","n/a","n/a","n/a","n/a","n/a","n/a",0,1.7462259428410787,14.5]
[5.3678727484454827E-7,47.500885711288127,3.3013709766631543,1.364513974486134E-2,0.42159201751867709,0.84546253290367313,2.1980103124339259,"n/a","n/a","n/a","n/a","n/a","n/a","n/a","n/a","n/a","n/a","n/a","n/a",0,1.7721261350495499,14.75]
[5.322952521497062E-7,47.535372310296843,{"$f":"$D$29*(V100*10^9)^2 + $D$30*(V100*10^9) + $D$31","v":3.2965824685817458},{"$f":"$D$32*(V100*10^9)^2 + $D$33*(V100*10^9) + $D$34","v":1.3673062845976677E-2},0.42484137575016212,{"$f":" ( (20*LOG(EXP(1))/2) * 2*PI()*$V100*10^9 * $D100 *SQRT($C100) ) / (299792458*39.3700787 )","v":0.86092681561478446},2.2054465824491016,"n/a","n/a","n/a","n/a","n/a","n/a","n/a","n/a","n/a","n/a","n/a","n/a",0,1.7978917758459541,15]
[{"$f":"SQRT(1/(PI()*59600000*0.00000125663))*SQRT(1/($V101*1000000000))","v":5.2791414676555063E-7},{"$f":" 94.15/( SQRT($C101)*( (($D$4/$D$6)/(1-$D$5/$D$6)) + ((((2/(1-$D$5/$D$6))*LN((1/(1-$D$5/$D$6))+1))-(((1/(1-$D$5/$D$6))-1)*LN((1/((1-$D$5/$D$6)^2))-1)))/PI() ) ) )","v":47.569901186388805},3.2917985201747322,1.3699545833477976E-2,{"$f":"IF(    1/(SQRT(PI()*(4*PI()*10^-7*0.999994)*59600000*$V101*10^9)) >= $D$5*0.0000254,                       (20*LOG(EXP(1))/2)  *  ((1/59600000)*39.3700787/($D$5*0.001)*(1/(0.001*$D$4)+1/(6*0.001*($D$6-$D$5)/2)))   *   (1/$B101),                          (20*LOG(EXP(1))/2)  *  ((SQRT(PI()*(4*PI()*10^-7*0.999994)/59600000)*SQRT($V101*10^9)*(1/(0.001*$D$4)+1/(6*0.001*($D$6-$D$5)/2))))/2  *  (1/$B101)     )","v":0.42805615815031101},0.87633433944663286,{"$f":"1 + ((3/2)*($C$14)*4*PI()*($D$14)^2)/(0.0000094*0.00000814)/(1+$A101/$D$14+$A101^2/2/($D$14)^2)","v":2.2127598175769188},{"$f":" IF($J$3=0,\"n/a\", 94.15/( SQRT($I101)*( (($J$4/$J$6)/(1-$J$5/$J$6)) + ((((2/(1-$J$5/$J$6))*LN((1/(1-$J$5/$J$6))+1))-(((1/(1-$J$5/$J$6))-1)*LN((1/((1-$J$5/$J$6)^2))-1)))/PI() ) ) ))","v":"n/a"},{"$f":" IF($J$3=0,\"n/a\", $J$29*(V101*10^9)^2 + $J$30*(V101*10^9) + $J$31)","v":"n/a"},{"$f":" IF($J$3=0,\"n/a\", $J$32*(V101*10^9)^2 + $J$33*(V101*10^9) + $J$34)","v":"n/a"},{"$f":" IF($J$3=0,\"n/a\", IF(    1/(SQRT(PI()*(4*PI()*10^-7*0.999994)*59600000*$V101*10^9)) >= $J$5*0.0000254,                       (20*LOG(EXP(1))/2)  *  ((1/59600000)*39.3700787/($J$5*0.001)*(1/(0.001*$J$4)+1/(6*0.001*($J$6-$J$5)/2)))   *   (1/$H101),                          (20*LOG(EXP(1))/2)  *  ((SQRT(PI()*(4*PI()*10^-7*0.999994)/59600000)*SQRT($V101*10^9)*(1/(0.001*$J$4)+1/(6*0.001*($J$6-$J$5)/2))))/2  *  (1/$H101)     ))","v":"n/a"},{"$f":" IF($J$3=0,\"n/a\", ( (20*LOG(EXP(1))/2) * 2*PI()*$V101*10^9 * $J101 *SQRT($I101) ) / (299792458*39.3700787 ))","v":"n/a"},{"$f":" IF($J$3=0,\"n/a\", 1 + ((3/2)*($I$14)*4*PI()*($J$14)^2)/(0.0000094*0.00000814)/(1+$A101/$J$14+$A101^2/2/($J$14)^2)  )","v":"n/a"},{"$f":" IF($P$3=0,\"n/a\", 94.15/( SQRT($O101)*( (($P$4/$P$6)/(1-$P$5/$P$6)) + ((((2/(1-$P$5/$P$6))*LN((1/(1-$P$5/$P$6))+1))-(((1/(1-$P$5/$P$6))-1)*LN((1/((1-$P$5/$P$6)^2))-1)))/PI() ) ) ) )","v":"n/a"},{"$f":" IF($P$3=0,\"n/a\", $P$29*(V101*10^9)^2 + $P$30*(V101*10^9) + $P$31 )","v":"n/a"},{"$f":" IF($P$3=0,\"n/a\", $P$32*(V101*10^9)^2 + $P$33*(V101*10^9) + $P$34 )","v":"n/a"},{"$f":" IF($P$3=0,\"n/a\", IF(    1/(SQRT(PI()*(4*PI()*10^-7*0.999994)*59600000*$V101*10^9)) >= $P$5*0.0000254,                       (20*LOG(EXP(1))/2)  *  ((1/59600000)*39.3700787/($P$5*0.001)*(1/(0.001*$P$4)+1/(6*0.001*($P$6-$P$5)/2)))   *   (1/$N101),                          (20*LOG(EXP(1))/2)  *  ((SQRT(PI()*(4*PI()*10^-7*0.999994)/59600000)*SQRT($V101*10^9)*(1/(0.001*$P$4)+1/(6*0.001*($P$6-$P$5)/2))))/2  *  (1/$N101)     ))","v":"n/a"},{"$f":" IF($P$3=0,\"n/a\", ( (20*LOG(EXP(1))/2) * 2*PI()*$V101*10^9 * $P101 *SQRT($O101) ) / (299792458*39.3700787 ) )","v":"n/a"},{"$f":" IF($P$3=0,\"n/a\", 1 + ((3/2)*($O$14)*4*PI()*($P$14)^2)/(0.0000094*0.00000814)/(1+$A101/$P$14+$A101^2/2/($P$14)^2) )","v":"n/a"},0,{"$f":"F101*$D$3 + E101*G101*$D$3    +    $T101    +   IF(OR(K101=\"n/a\",L101=\"n/a\",M101=\"n/a\"),0, (L101 + K101*M101)*$J$3)    +    $T101    +    IF(OR(Q101=\"n/a\",R101=\"n/a\",S101=\"n/a\"),0, (R101 + Q101*S101)*$P$3)","v":1.8235198058679916},15.25]
[5.2363946793736654E-7,47.604472397573488,3.2870191314421149,1.3724588707365237E-2,0.43123715245915145,0.89168065849998446,2.2199536164605256,"n/a","n/a","n/a","n/a","n/a","n/a","n/a","n/a","n/a","n/a","n/a","n/a",{"$f":"IF(AND($J$3=0, P$3=0), 0, 0.000009*SQRT($V102*1000000000)-0.000000000012*($V102*1000000000)+1.6E-21*($V102*1000000000)^2)","v":0},1.8490071346538168,15.5]
[5.194669754030562E-7,47.639086001891492,3.282244302383893,1.3748191467638461E-2,0.43438511533382268,0.9069613400239489,2.2270314255913837,"n/a","n/a","n/a","n/a","n/a","n/a","n/a","n/a","n/a","n/a","n/a","n/a",0,1.8743506426815095,15.75]
[5.1539266171027252E-7,47.673742057414117,3.2774740330000669,1.3770354114297648E-2,0.43750077405665838,0.92217196440842264,2.2339965477374171,"n/a","n/a","n/a","n/a","n/a","n/a","n/a","n/a","n/a","n/a","n/a","n/a",0,1.8995471832834452,16]
[5.1141273603567483E-7,47.708440622242861,3.2727083232906367,1.3791076647342798E-2,0.44058482812409205,0.93730812517650819,2.2408521497941942,"n/a","n/a","n/a","n/a","n/a","n/a","n/a","n/a","n/a","n/a","n/a","n/a",0,1.9245935844450854,16.25]
[5.0752360935779423E-7,47.743181754509031,3.2679471732556018,1.3810359066773911E-2,0.44363795072640938,0.95236542897689125,2.2476012701061054,"n/a","n/a","n/a","n/a","n/a","n/a","n/a","n/a","n/a","n/a","n/a","n/a",0,1.9494866504968389,16.5]
[5.0372188085168941E-7,47.777965512373257,3.2631905828949632,1.3828201372590984E-2,0.44666079012738541,0.96733949557619281,2.2542468253000818,"n/a","n/a","n/a","n/a","n/a","n/a","n/a","n/a","n/a","n/a","n/a","n/a",0,1.9742231637068777,16.75]
[5.00004325388161E-7,47.812791954025052,3.25843855220872,1.3844603564794021E-2,0.44965397095197551,0.98222595785128053,2.2607916166704394,"n/a","n/a","n/a","n/a","n/a","n/a","n/a","n/a","n/a","n/a","n/a","n/a",0,1.9987998857820801,17]
[4.9636788203309123E-7,47.847661137682309,3.2536910811968727,1.3859565643383021E-2,0.45261809538945291,0.99702046178155235,2.2672383361499042,"n/a","n/a","n/a","n/a","n/a","n/a","n/a","n/a","n/a","n/a","n/a","n/a",0,2.0232135592836742,17.25]
[4.9280964345369647E-7,47.882573121590895,3.2489481698594211,1.3873087608357985E-2,0.45555374431868695,1.0117186664411819,2.2735895718987091,"n/a","n/a","n/a","n/a","n/a","n/a","n/a","n/a","n/a","n/a","n/a","n/a",0,2.0474609089635596,17.5]
[4.8932684614836872E-7,47.917527964024131,3.2442098181963654,1.3885169459718912E-2,0.45846147836164719,1.0263162439913329,2.2798478135408056,"n/a","n/a","n/a","n/a","n/a","n/a","n/a","n/a","n/a","n/a","n/a","n/a",0,2.0715386430268197,17.75]
[4.8591686142549064E-7,47.952525723282335,3.2394760262077051,1.3895811197465798E-2,0.4613418388706565,1.0408088796723376,2.2860154570736819,"n/a","n/a","n/a","n/a","n/a","n/a","n/a","n/a","n/a","n/a","n/a","n/a",0,2.0954434543254541,18]
[4.8257718706430016E-7,47.987566457692374,3.2347467938934411,1.390501282159865E-2,0.46419534885442171,1.0551922717958429,2.2920948094759774,"n/a","n/a","n/a","n/a","n/a","n/a","n/a","n/a","n/a","n/a","n/a","n/a",0,2.1191720214879535,18.25]
[4.7930543959768968E-7,48.022650225607094,3.2300221212535725,1.3912774332117461E-2,0.46702251384743088,1.0694621317369191,2.2980880930350045,"n/a","n/a","n/a","n/a","n/a","n/a","n/a","n/a","n/a","n/a","n/a","n/a",0,2.1427210099889757,18.5]
[4.7609934716285362E-7,48.057777085404943,3.2253020082880997,1.391909572902224E-2,0.46982382272689538,1.0836141839261382,2.303997449414426,"n/a","n/a","n/a","n/a","n/a","n/a","n/a","n/a","n/a","n/a","n/a","n/a",0,2.1660870731630406,18.75]
[4.7295674287105735E-7,48.092947095489379,3.2205864549970227,1.3923977012312978E-2,0.47259974848106368,1.0976441658416118,2.3098249434806335,"n/a","n/a","n/a","n/a","n/a","n/a","n/a","n/a","n/a","n/a","n/a","n/a",0,2.1892668531658463,19]
[4.6987555865255858E-7,48.128160314288451,3.2158754613803415,1.3927418181989679E-2,0.47535074893240287,1.1115478280010007,2.315572566904847,"n/a","n/a","n/a","n/a","n/a","n/a","n/a","n/a","n/a","n/a","n/a","n/a",0,2.2122569818865463,19.25]
[4.6685381953695701E-7,48.16341680025424,3.2111690274380558,1.3929419238052344E-2,0.47807726741885143,1.1253209339534838,2.3212422415565621,"n/a","n/a","n/a","n/a","n/a","n/a","n/a","n/a","n/a","n/a","n/a","n/a",0,2.2350540818140545,19.5]
[4.6388963833302944E-7,48.198716611862388,3.2064671531701658,1.3929980180500968E-2,0.48077973343608366,1.1389592602716949,2.3268358227027184,"n/a","n/a","n/a","n/a","n/a","n/a","n/a","n/a","n/a","n/a","n/a","n/a",0,2.257654766860238,19.75]
[4.6098121067548891E-7,48.234059807611573,3.2017698385766717,1.3929101009335559E-2,0.48345856324348174,1.1524585965436231,2.3323551020258044,"n/a","n/a","n/a","n/a","n/a","n/a","n/a","n/a","n/a","n/a","n/a","n/a",0,2.2800556431426227,20]
[4.5812681040913106E-7,48.269446446023004,3.1970770836575735,1.3926781724556109E-2,0.48611416043629474,1.1658147453644769,2.3378018104730893,"n/a","n/a","n/a","n/a","n/a","n/a","n/a","n/a","n/a","n/a","n/a","n/a",0,2.3022533097290525,20.25]
[4.5532478528354017E-7,48.304876585639896,3.1923888884128711,1.3923022326162625E-2,0.48874691648626883,1.1790235223285153,2.3431776209482136,"n/a","n/a","n/a","n/a","n/a","n/a","n/a","n/a","n/a","n/a","n/a","n/a",0,2.3242443593465856,20.5]
[4.5257355293395902E-7,48.340350285026936,3.187705252842564,1.3917822814155101E-2,0.49135721125284831,1.1920807560208382,2.3484841508554997,"n/a","n/a","n/a","n/a","n/a","n/a","n/a","n/a","n/a","n/a","n/a","n/a",0,2.34602537905671,20.75]
[4.4987159712611274E-7,48.375867602769766,3.1830261769466532,1.391118318853354E-2,0.49394541346688603,1.204982288009147,2.3537229645065767,"n/a","n/a","n/a","n/a","n/a","n/a","n/a","n/a","n/a","n/a","n/a","n/a",0,2.3675929508988527,21]
[4.4721746424474076E-7,48.411428597474462,3.1783516607251379,1.3903103449297944E-2,0.49651188118865164,1.2177239728354619,2.3588955753981589,"n/a","n/a","n/a","n/a","n/a","n/a","n/a","n/a","n/a","n/a","n/a","n/a",0,2.3889436525039889,21.25]
[4.4460976000736218E-7,48.447033327766967,3.1736817041780183,1.3893583596448308E-2,0.49905696224179363,1.2303016780078084,2.3640034483692007,"n/a","n/a","n/a","n/a","n/a","n/a","n/a","n/a","n/a","n/a","n/a","n/a",0,2.4100740576800668,21.5]
[4.4204714638639863E-7,48.482681852292572,3.1690163073052946,1.3882623629984638E-2,0.5015809946247769,1.2427112839918657,2.3690480016449973,"n/a","n/a","n/a","n/a","n/a","n/a","n/a","n/a","n/a","n/a","n/a","n/a",0,2.4309807369708034,21.75]
[4.3952833872421955E-7,48.518374229715356,3.1643554701069663,1.3870223549906927E-2,0.50408430690121886,1.2549486842025763,2.3740306087752945,"n/a","n/a","n/a","n/a","n/a","n/a","n/a","n/a","n/a","n/a","n/a","n/a",0,2.4516602581893494,22]
[4.3705210302697913E-7,48.554110518717636,3.1596991925830342,1.3856383356215182E-2,0.50656721857042863,1.2670097849957207,2.3789526004729291,"n/a","n/a","n/a","n/a","n/a","n/a","n/a","n/a","n/a","n/a","n/a","n/a",0,2.4721091869281806,22.25]
[4.3461725342429691E-7,48.589890777999415,3.1550474747334976,1.3841103048909398E-2,0.50903004041936761,1.2788905056594542,2.3838152663590702,"n/a","n/a","n/a","n/a","n/a","n/a","n/a","n/a","n/a","n/a","n/a","n/a",0,2.4923240870465175,22.5]
[4.322226497829023E-7,48.625715066277827,3.1504003165583567,1.3824382627989573E-2,0.51147307485715998,1.2905867784058065,2.3886198566207089,"n/a","n/a","n/a","n/a","n/a","n/a","n/a","n/a","n/a","n/a","n/a","n/a",0,2.512301521136469,22.75]
[4.2986719546333445E-7,48.661583442286535,3.1457577180576117,1.3806222093455715E-2,0.51389661623320049,{"$f":" ( (20*LOG(EXP(1))/2) * 2*PI()*$V132*10^9 * $D132 *SQRT($C132) ) / (299792458*39.3700787 )","v":1.3020945483621471},2.393367583585627,"n/a","n/a","n/a","n/a","n/a","n/a","n/a","n/a","n/a","n/a","n/a","n/a",0,2.5320380509690326,23]
[4.2754983520967339E-7,48.697495964775214,3.1411196792312621,1.3786621445307821E-2,0.51630095113983387,1.3134097735626036,2.3980596232197424,"n/a","n/a","n/a","n/a","n/a","n/a","n/a","n/a","n/a","n/a","n/a","n/a",0,2.5515302379209883,23.25]
[4.2526955316307673E-7,48.733452692508919,3.1364862000793088,1.3765580683545886E-2,0.51868635870051327,1.3245284249394531,2.4026971165513684,"n/a","n/a","n/a","n/a","n/a","n/a","n/a","n/a","n/a","n/a","n/a","n/a",0,2.5707746433837051,23.5]
[4.2302537099062937E-7,48.769453684267553,3.1318572806017508,1.3743099808169915E-2,0.52105311084428074,1.335446486314471,2.407281171026634,"n/a","n/a","n/a","n/a","n/a","n/a","n/a","n/a","n/a","n/a","n/a","n/a",0,2.5897678291547619,23.75]
[4.2081634612167757E-7,48.805498998845231,3.1272329207985887,1.3719178819179906E-2,0.52340147256735881,1.3461599543902396,2.411812861800013,"n/a","n/a","n/a","n/a","n/a","n/a","n/a","n/a","n/a","n/a","n/a","n/a",0,2.6085063578132623,24]
[4.1864157008442703E-7,48.841588695049751,3.1226131206698224,1.3693817716575862E-2,0.52573170218258425,1.3566648387414215,2.4162932329636657,"n/a","n/a","n/a","n/a","n/a","n/a","n/a","n/a","n/a","n/a","n/a","n/a",0,2.6269867930796691,24.25]
[4.165001669361348E-7,48.877722831701909,3.117997880215452,1.3667016500357778E-2,0.52804405155737155,1.3669571618059926,2.4207232987190261,"n/a","n/a","n/a","n/a","n/a","n/a","n/a","n/a","n/a","n/a","n/a","n/a",0,2.6452057001609126,24.5]
[4.1439129178073792E-7,48.913901467635007,3.1133871994354769,1.3638775170525658E-2,0.53033876634084276,1.3770329588764374,2.4251040444938727,"n/a","n/a","n/a","n/a","n/a","n/a","n/a","n/a","n/a","n/a","n/a","n/a",0,2.6631596460815059,24.75]
[4.1231412936821794E-7,48.950124661694147,3.1087810783298977,1.36090937270795E-2,0.53261608618072609,1.3868882780909062,2.4294364280078931,"n/a","n/a","n/a","n/a","n/a","n/a","n/a","n/a","n/a","n/a","n/a","n/a",0,2.6808452000013538,25]
[4.1026789277042957E-7,48.986392472735666,3.1041795168987147,1.3577972170019305E-2,0.53487624493057728,1.3965191804243304,2.4337213802895623,"n/a","n/a","n/a","n/a","n/a","n/a","n/a","n/a","n/a","n/a","n/a","n/a",0,2.6982589335208731,25.25]
[4.0825182212850767E-7,49.022704959626523,3.0995825151419272,1.3545410499345073E-2,0.53711947084785161,1.4059217396795001,2.437959806646985,"n/a","n/a","n/a","n/a","n/a","n/a","n/a","n/a","n/a","n/a","n/a","n/a",0,2.7153974209740595,25.5]
[4.0626518346732517E-7,49.059062181243668,3.094990073059535,1.3511408715056804E-2,0.53934598678331314,1.4150920424781039,2.4421525875951682,"n/a","n/a","n/a","n/a","n/a","n/a","n/a","n/a","n/a","n/a","n/a","n/a",0,2.7322572397100418,25.75]
[4.0430726757280062E-7,49.095464196473387,3.0904021906515391,1.3475966817154496E-2,0.54155601036224521,1.4240261882517262,2.4463005797420658,"n/a","n/a","n/a","n/a","n/a","n/a","n/a","n/a","n/a","n/a","n/a","n/a",0,2.7488349703636867,26]
[4.0237738892815486E-7,49.131911064210733,3.085818867917939,1.343908480563815E-2,0.54374975415788795,1.4327202892328066,2.4504046166355513,"n/a","n/a","n/a","n/a","n/a","n/a","n/a","n/a","n/a","n/a","n/a","n/a",0,2.7651271971157412,26.25]
[4.0047488470549419E-7,49.16840284335882,3.0812401048587343,1.340076268050777E-2,0.5459274258575102,1.4411704704455586,2.4544655095733852,"n/a","n/a","n/a","n/a","n/a","n/a","n/a","n/a","n/a","n/a","n/a","n/a",0,2.7811305079429989,26.5]
[3.9859911380935062E-7,49.204939592828218,3.076665901473925,1.3361000441763349E-2,0.54808922842149721,1.4493728696968469,2.4584840483780912,"n/a","n/a","n/a","n/a","n/a","n/a","n/a","n/a","n/a","n/a","n/a","n/a",0,2.7968414948589535,26.75]
[3.9674945596904469E-7,49.241521371536273,3.072096257763512,1.3319798089404894E-2,0.55023536023580466,1.4573236375670273,2.462461002138542,"n/a","n/a","n/a","n/a","n/a","n/a","n/a","n/a","n/a","n/a","n/a","n/a",0,2.8122567541453485,27]
[3.9492531087695352E-7,49.278148238406501,3.0675311737274948,1.32771556234324E-2,0.55236601525812234,1.4650189374007434,2.466397119919967,"n/a","n/a","n/a","n/a","n/a","n/a","n/a","n/a","n/a","n/a","n/a","n/a",0,2.8273728865750449,27.25]
[3.9312609736996319E-7,49.314820252367895,3.062970649365873,1.3233073043845869E-2,0.55448138315805651,1.4724549452976832,2.4702931314439724,"n/a","n/a","n/a","n/a","n/a","n/a","n/a","n/a","n/a","n/a","n/a","n/a",0,2.8421864976265834,27.5]
[3.9135125265157439E-7,49.351537472354245,3.0584146846786475,1.31875503506453E-2,0.55658164945163224,1.4796278501032942,2.4741497477400722,"n/a","n/a","n/a","n/a","n/a","n/a","n/a","n/a","n/a","n/a","n/a","n/a",0,2.8566941976908033,27.75]
[3.896002315522921E-7,49.388299957303502,3.0538632796658174,1.3140587543830694E-2,0.55866699563039235,1.4865338533994608,2.4779676617701676,"n/a","n/a","n/a","n/a","n/a","n/a","n/a","n/a","n/a","n/a","n/a","n/a",0,2.8708926022698682,28]
[3.8787250582609691E-7,49.425107766157069,3.0493164343273831,1.3092184623402052E-2,0.56073759928535816,1.4931691694951335,2.4817475490272902,"n/a","n/a","n/a","n/a","n/a","n/a","n/a","n/a","n/a","n/a","n/a","n/a",0,2.8847783321690179,28.25]
[3.8616756348093199E-7,49.461960957859162,3.0447741486633442,1.3042341589359371E-2,0.56279363422610051,1.4995300254169233,2.4854900681098777,"n/a","n/a","n/a","n/a","n/a","n/a","n/a","n/a","n/a","n/a","n/a","n/a",0,2.8983480136813595,28.5]
[3.84484908141282E-7,49.498859591356045,3.0402364226737015,1.2991058441702653E-2,0.56483527059515493,1.5056126608996514,2.4891958612727727,"n/a","n/a","n/a","n/a","n/a","n/a","n/a","n/a","n/a","n/a","n/a","n/a",0,2.9115982787659975,28.75]
[3.8282405844103977E-7,49.535803725595422,3.0357032563584543,1.2938335180431897E-2,0.56686267497800125,1.5114133283768563,2.4928655549560608,"n/a","n/a","n/a","n/a","n/a","n/a","n/a","n/a","n/a","n/a","n/a","n/a",0,2.9245257652197685,29]
[3.8118454744497505E-7,49.572793419525702,3.0311746497176033,1.2884171805547105E-2,0.5688760105088182,1.5169282929712598,2.4964997602928083,"n/a","n/a","n/a","n/a","n/a","n/a","n/a","n/a","n/a","n/a","n/a","n/a",0,2.9371271168428534,29.25]
[3.7956592209722713E-7,49.609828732095266,3.0266506027511477,1.2828568317048275E-2,0.57087543697221055,1.5221538324851906,2.500099073596703,"n/a","n/a","n/a","n/a","n/a","n/a","n/a","n/a","n/a","n/a","n/a","n/a",0,2.9493989835985275,29.5]
[3.7796774269534089E-7,49.646909722251806,3.0221311154590875,1.2771524714935407E-2,0.57286111090109149,1.5270862373909653,2.503664076830538,"n/a","n/a","n/a","n/a","n/a","n/a","n/a","n/a","n/a","n/a","n/a","n/a",0,2.9613380217672631,29.75]
[3.7638958238846044E-7,49.684036448941569,3.0176161878414236,1.2713040999208503E-2,0.57483318567090225,1.5317218108212263,2.5071953380564391,"n/a","n/a","n/a","n/a","n/a","n/a","n/a","n/a","n/a","n/a","n/a","n/a",0,2.9729408940954438,30]
[{"$error":"#DIV/0!"}]
[{"$error":"#DIV/0!"}]
[{"$error":"#DIV/0!"}]
[{"$error":"#DIV/0!"}]
[{"$f":"SQRT(1/(PI()*59600000*0.00000125663))*SQRT(1/($V165*1000000000))","v":{"$error":"#DIV/0!"}}]
[{"$error":"#DIV/0!"}]
[{"$error":"#DIV/0!"}]
[{"$error":"#DIV/0!"}]
[{"$error":"#DIV/0!"}]
[{"$error":"#DIV/0!"}]
[{"$error":"#DIV/0!"}]
[{"$error":"#DIV/0!"}]
[{"$error":"#DIV/0!"}]
[{"$error":"#DIV/0!"}]
[{"$error":"#DIV/0!"}]
[{"$error":"#DIV/0!"}]
[{"$error":"#DIV/0!"}]
[{"$error":"#DIV/0!"}]
[{"$error":"#DIV/0!"}]
[{"$error":"#DIV/0!"}]
[{"$error":"#DIV/0!"}]
[{"$error":"#DIV/0!"}]
[{"$error":"#DIV/0!"}]
[{"$error":"#DIV/0!"}]
[{"$error":"#DIV/0!"}]
[{"$error":"#DIV/0!"}]
[{"$error":"#DIV/0!"}]
[{"$error":"#DIV/0!"}]
[{"$error":"#DIV/0!"}]
[{"$error":"#DIV/0!"}]
[{"$error":"#DIV/0!"}]
[{"$error":"#DIV/0!"}]
[{"$error":"#DIV/0!"}]
[{"$error":"#DIV/0!"}]
[{"$error":"#DIV/0!"}]
[{"$error":"#DIV/0!"}]
[{"$error":"#DIV/0!"}]
[{"$error":"#DIV/0!"}]
[{"$error":"#DIV/0!"}]
[{"$error":"#DIV/0!"}]
[{"$error":"#DIV/0!"}]
[{"$error":"#DIV/0!"}]
[{"$error":"#DIV/0!"}]
[{"$error":"#DIV/0!"}]
[{"$error":"#DIV/0!"}]
[{"$error":"#DIV/0!"}]
[{"$error":"#DIV/0!"}]
[{"$error":"#DIV/0!"}]
[{"$error":"#DIV/0!"}]
[{"$error":"#DIV/0!"}]
[{"$error":"#DIV/0!"}]
[{"$error":"#DIV/0!"}]
[{"$error":"#DIV/0!"}]
[{"$error":"#DIV/0!"}]
[{"$error":"#DIV/0!"}]
[{"$error":"#DIV/0!"}]
[{"$error":"#DIV/0!"}]
[{"$error":"#DIV/0!"}]
[{"$error":"#DIV/0!"}]
[{"$error":"#DIV/0!"}]
[{"$error":"#DIV/0!"}]
[{"$error":"#DIV/0!"}]
[{"$error":"#DIV/0!"}]
[{"$error":"#DIV/0!"}]
[{"$error":"#DIV/0!"}]
[{"$error":"#DIV/0!"}]
[{"$error":"#DIV/0!"}]
[{"$error":"#DIV/0!"}]
[{"$f":"SQRT(1/(PI()*59600000*0.00000125663))*SQRT(1/($V229*1000000000))","v":{"$error":"#DIV/0!"}}]
[{"$error":"#DIV/0!"}]
[{"$error":"#DIV/0!"}]
[{"$error":"#DIV/0!"}]
[{"$error":"#DIV/0!"}]
[{"$error":"#DIV/0!"}]
[{"$error":"#DIV/0!"}]
[{"$error":"#DIV/0!"}]
[{"$error":"#DIV/0!"}]
[{"$error":"#DIV/0!"}]
[{"$error":"#DIV/0!"}]
[{"$error":"#DIV/0!"}]
[{"$error":"#DIV/0!"}]
[{"$error":"#DIV/0!"}]
[{"$error":"#DIV/0!"}]
[{"$error":"#DIV/0!"}]
[{"$error":"#DIV/0!"}]
[{"$error":"#DIV/0!"}]
[{"$error":"#DIV/0!"}]
[{"$error":"#DIV/0!"}]
[{"$error":"#DIV/0!"}]
[{"$error":"#DIV/0!"}]
[{"$error":"#DIV/0!"}]
[{"$error":"#DIV/0!"}]
[{"$error":"#DIV/0!"}]
[{"$error":"#DIV/0!"}]
[{"$error":"#DIV/0!"}]
[{"$error":"#DIV/0!"}]
[{"$error":"#DIV/0!"}]
[{"$error":"#DIV/0!"}]
[{"$error":"#DIV/0!"}]
[{"$error":"#DIV/0!"}]
[{"$error":"#DIV/0!"}]
[{"$error":"#DIV/0!"}]
[{"$error":"#DIV/0!"}]
[{"$error":"#DIV/0!"}]
[{"$error":"#DIV/0!"}]
[{"$error":"#DIV/0!"}]
[{"$error":"#DIV/0!"}]
[{"$error":"#DIV/0!"}]
[{"$error":"#DIV/0!"}]
[{"$error":"#DIV/0!"}]

{"sheet":"Material References","index":1,"n_rows":24,"n_cols":4,"rows_kept":24,"cut":false,"hidden":false,"merged":[]}
[]
[null,"Megtron 6","Dk","Df"]
[null,100000000,3.67,3.8999999999999998E-3]
[null,1000000000,3.65,4.0000000000000001E-3]
[null,2000000000,3.59,4.3E-3]
[null,5000000000,3.5760000000000001,4.8999999999999998E-3]
[null,10000000000,3.3494000000000002,5.4999999999999997E-3]
[null,20000000000,3,6.4999999999999997E-3]
[]
[null,"Nelco 4000-13SI","Dk","Df"]
[null,100000000,3.6,9.1999999999999998E-3]
[null,1000000000,3.52,1.15E-2]
[null,2000000000,3.49,1.0800000000000001E-2]
[null,5000000000,3.46,1.0999999999999999E-2]
[null,10000000000,3.44,1.12E-2]
[null,20000000000,3.43,1.14E-2]
[]
[null,"Improved FR4","Dk","Df"]
[null,100000000,3.6,9.1999999999999998E-3]
[null,1000000000,3.6,9.1999999999999998E-3]
[null,2000000000,3.5,1.15E-2]
[null,5000000000,3.5,1.15E-2]
[null,10000000000,3.4,1.2500000000000001E-2]
[null,20000000000,3.2,1.4E-2]

{"sheet":"KR Spec","index":2,"n_rows":129,"n_cols":12,"rows_kept":129,"cut":false,"hidden":false,"merged":[[2,0,2,3]]}
["b1",2.0000000000000002E-5,"b2",1.0999999999999999E-10,"b3",3.1999999999999997E-20,"b4",-1.1999999999999999E-30]
["F1",1000000000,"F2",6000000000,"Fa",100000000,"Fb",5156250000,"fmin",50000000,"fmax",15000000000]
["KR MAXIMUM INSERTION LOSS"]
["Freq","Freq (GHz)","Fitted Attenuation","Insertion Loss"]
[10000000,{"$f":"A5*0.000000001","v":0.01},{"$f":"20 * LOG(EXP(1)) * ($B$1*SQRT(A5) + $D$1*A5 + $F$1*(A5^2) + $H$1*(A5^3))","v":0.55892615824846736},{"$f":" IF(A5<$J$2,,IF(A5<$D$2,C5+0.8+0.0000000002*A5,IF(A5<$L$2,C5+0.8+0.0000000002*$D$2+0.00000001*(A5-$D$2),)))","v":0}]
[50000000,{"$f":"A6*0.000000001","v":0.05},{"$f":"20 * LOG(EXP(1)) * ($B$1*SQRT(A6) + $D$1*A6 + $F$1*(A6^2) + $H$1*(A6^3))","v":1.276836254039708},2.0868362540397078]
[100000000,0.1,1.835491775248338,2.655491775248338]
[150000000,0.15000000000000002,2.2771355992531457,3.1071355992531458]
[200000000,0.2,2.6588647117191306,3.4988647117191309]
[250000000,0.25,3.0027903600063128,3.8527903600063125]
[500000000,0.5,4.4303560989072821,5.3303560989072816]
[750000000,0.75,5.6259923637648699,6.5759923637648701]
[1000000000,1,6.7164122132677724,7.7164122132677724]
[1250000000,1.25,7.7500982170117352,8.800098217011735]
[1500000000,1.5,8.7514391742315407,9.8514391742315421]
[1750000000,1.75,9.734526467178636,10.884526467178636]
[2000000000,2,10.708200923830994,11.908200923830995]
[2250000000,2.25,11.678304981139654,12.928304981139654]
[2500000000,2.5,12.648826785432208,13.948826785432209]
[2750000000,2.75,13.622537581278499,14.9725375812785]
[3000000000,3,14.601372345588093,16.001372345588095]
[3250000000,3.25,15.586669787441192,17.036669787441191]
[3500000000,3.5,16.579330444096289,18.079330444096289]
[3750000000,3.7500000000000004,17.579924646865791,19.129924646865792]
[4000000000,4,18.588768515690948,20.188768515690949]
[4250000000,4.25,19.605978844460164,21.255978844460166]
[4500000000,4.5,20.631513629850605,22.331513629850605]
[4750000000,4.75,21.665202582942914,23.415202582942914]
[5000000000,5,22.706770493105555,24.506770493105556]
[5250000000,5.25,23.755855390018517,25.605855390018519]
[5500000000,5.5,24.812022853016185,26.712022853016187]
[5750000000,5.75,25.874777421900152,27.824777421900151]
[6000000000,6,26.943571796075975,28.943571796075975]
[6250000000,6.25,28.017814324419682,32.517814324419682]
[6500000000,6.5,29.096875158727283,36.096875158727286]
[6750000000,6.75,30.180091351129786,39.680091351129789]
[7000000000,7,31.266771108879578,43.266771108879581]
[7250000000,7.2500000000000009,32.356197370745974,46.856197370745974]
[7500000000,7.5000000000000009,33.447630832714978,50.447630832714978]
[7750000000,7.7500000000000009,34.540312523218304,54.040312523218304]
[8000000000,8,35.633466007246838,57.633466007246838]
[8250000000,8.25,36.726299282694342,61.226299282694342]
[8500000000,8.5,37.818006419881186,64.818006419881186]
[8750000000,8.75,38.907768985530851,68.407768985530851]
[9000000000,9,39.994757284854309,71.994757284854302]
[9250000000,9.25,41.078131449358466,75.578131449358466]
[9500000000,9.5,42.157042393171992,79.157042393171992]
[9750000000,9.75,43.230632656805973,82.730632656805966]
[10000000000,10,44.298037154131677,86.298037154131677]
[10250000000,10.25,45.358383835807821,89.858383835807814]
[10500000000,10.5,46.410794280302731,93.410794280302724]
[10750000000,10.75,47.454384221941979,96.954384221941979]
[11000000000,11,48.488264023993132,100.48826402399314]
[11250000000,11.25,49.511539103622468,104.01153910362247]
[11500000000,11.5,50.523310314575745,107.52331031457575]
[11750000000,11.75,51.52267429261272,111.02267429261272]
[12000000000,12,52.50872376803229,114.5087237680323]
[12250000000,12.25,53.480547849041301,117.9805478490413]
[12500000000,12.5,54.437232279224148,121.43723227922415]
[12750000000,12.75,55.377859671948535,124.87785967194853]
[13000000000,13,56.301509724184058,128.30150972418406]
[13250000000,13.25,57.207259411900473,131.70725941190048]
[13500000000,13.5,58.094183168949641,135.09418316894966]
[13750000000,13.75,58.961353051105398,138.46135305110539]
[14000000000,14,59.807838886739916,141.80783888673992]
[14250000000,14.25,60.632708415442814,145.13270841544281]
[14500000000,14.500000000000002,61.435027415742496,148.4350274157425]
[14750000000,14.750000000000002,62.213859822958099,151.71385982295811]
[15000000000,15.000000000000002,{"$f":"20 * LOG(EXP(1)) * ($B$1*SQRT(A69) + $D$1*A69 + $F$1*(A69^2) + $H$1*(A69^3))","v":62.968267838099166},{"$f":" IF(A69<$J$2,,IF(A69<$D$2,C69+0.8+0.0000000002*A69,IF(A69<$L$2,C69+0.8+0.0000000002*$D$2+0.00000001*(A69-$D$2),)))","v":0}]
[15250000000,{"$f":"A70*0.000000001","v":15.250000000000002},63.697312028630044,0]
[15500000000,15.500000000000002,64.400051421829644,0]
[15750000000,15.750000000000002,65.075543591401171,0]
[16000000000,16,65.722844737918834,0]
[16250000000,16.25,66.341009763639107,0]
[16500000000,16.5,66.929092342151733,0]
[16750000000,16.75,67.486144983298971,0]
[17000000000,17,68.011219093750185,0]
[17250000000,17.25,68.503365033581701,0]
[17500000000,17.5,68.961632169179694,0]
[17750000000,17.75,69.385068922753618,0]
[18000000000,18,69.772722818722059,0]
[18250000000,18.25,70.123640527209261,0]
[18500000000,18.5,70.436867904868848,0]
[18750000000,18.75,70.711450033233433,0]
[19000000000,19,70.946431254770289,0]
[19250000000,19.25,71.140855206809093,0]
[19500000000,19.5,71.293764853492988,0]
[19750000000,19.75,71.404202515891953,0]
[20000000000,20,71.471209900406237,0]
[20250000000,20.25,71.493828125576485,0]
[20500000000,20.5,71.471097747409488,0]
[20750000000,20.75,71.402058783317628,0]
[21000000000,21,71.285750734764378,0]
[21250000000,21.25,71.121212608700077,0]
[21500000000,21.5,70.907482937866376,0]
[21750000000,21.75,70.643599800040562,0]
[22000000000,22,70.328600836287961,0]
[22250000000,22.25,69.961523268283287,0]
[22500000000,22.5,69.541403914758234,0]
[22750000000,22.75,69.06727920712926,0]
[23000000000,23,68.538185204354789,0]
[23250000000,23.25,67.953157607067098,0]
[23500000000,23.5,67.311231771022477,0]
[23750000000,23.75,66.611442719909235,0]
[24000000000,24,65.852825157550342,0]
[24250000000,24.25,65.034413479535615,0]
[24500000000,24.5,64.155241784315734,0]
[24750000000,24.75,63.21434388378777,0]
[25000000000,25,62.210753313401241,0]
[25250000000,25.25,61.143503341809776,0]
[25500000000,25.5,60.011626980094654,0]
[25750000000,25.75,58.81415699058163,0]
[26000000000,26,57.550125895273915,0]
[26250000000,26.25,56.218565983920996,0]
[26500000000,26.5,54.818509321742233,0]
[26750000000,26.75,53.348987756823838,0]
[27000000000,27,51.809032927205031,0]
[27250000000,27.25,50.197676267669458,0]
[27500000000,27.5,48.513949016257634,0]
[27750000000,27.75,46.756882220512622,0]
[28000000000,28,44.925506743473697,0]
[28250000000,28.25,43.018853269429442,0]
[28500000000,28.5,41.035952309442372,0]
[28750000000,28.750000000000004,38.975834206655612,0]
[29000000000,29.000000000000004,36.837529141393141,0]
[29250000000,29.250000000000004,34.620067136061436,0]
[29500000000,29.500000000000004,32.322478059864331,0]
[29750000000,29.750000000000004,29.943791633336925,0]
[30000000000,30.000000000000004,27.483037432709853,0]