{"text_format":"1","workbook":"xlsx","n_sheets":4,"sheets":["UserInput","Material References","KR Spec","Attenuation Plot"],"not_rendered":{"charts":5,"images":0,"macros":1,"external_links":0,"defined_names":8,"comments":0,"pivot_tables":0},"unopened":[{"sheet":"Attenuation Plot","index":3,"reason":"not_a_worksheet"}],"bounds":{"document_bytes":16777216,"sheet_cells":100000,"rows_first":2000,"rows_last":500,"rows_between":2000,"halvings":0,"cell_chars":16384,"cell_head_chars":4096},"cells_cut":0,"cells_raw":0,"read":"whole","date_system":"1900"}

{"sheet":"UserInput","index":0,"n_rows":160,"n_cols":22,"rows_kept":160,"cut":false,"hidden":false,"merged":[[0,4,0,7],[1,1,1,3],[1,7,1,9],[1,13,1,15],[2,1,2,2],[2,5,32,5],[2,7,2,8],[2,13,2,14],[3,1,3,2],[3,7,3,8],[3,13,3,14],[4,1,4,2],[4,7,4,8],[4,13,4,14],[5,1,5,2],[5,7,5,8],[5,13,5,14],[31,1,33,1],[31,7,33,7],[31,13,33,13],[5,19,5,20],[6,19,6,20],[7,19,7,20],[28,1,30,1],[28,7,30,7],[28,13,30,13]]}
[null,"Version 2.01","LOSS SNAPSHOT:","Loss at 5GHz:",{"$f":"CONCATENATE(\"     \",ROUND(U60,2),\" dB\")","v":"     0.28 dB"},null,null,null,"Loss at 12.75GHz:",{"$f":"CONCATENATE(\"     \",ROUND(U91,2),\" dB\")","v":"     0.63 dB"},null,null,null,"Loss at 14GHz:",{"$f":"CONCATENATE(\"     \",ROUND(U96,2),\" dB\")","v":"     0.68 dB"}]
[null,"Backplane/Trace Material",null,null,null,null,null,"Linecard A Material",null,null,null,null,null,"Linecard B Material"]
[null,"Length (inch)",null,1,null,{"$f":"IF(AND(J3=0,P3=0),\"no connector included\",CONCATENATE(\"2 connectors - loss at each - \",ROUND(T60,3),\"dB loss at 5G - \",ROUND(T91,3),\"dB loss at 12.75G - \",ROUND(T96,3),\"dB loss at 14G\"))","v":"no connector included"},null,"Length (inch)",null,0,null,null,null,"Length (inch)",null,0]
[null,"Trace Width (mil)",null,8,null,null,null,"Trace Width (mil)",null,null,null,null,null,"Trace Width (mil)"]
[null,"Cu Thickness (mil)",null,0.6,null,null,null,"Cu Thickness (mil)",null,null,null,null,null,"Cu Thickness (mil)"]
[null,"Diel. Thickness (mil)",null,16,null,null,null,"Diel. Thickness (mil)",null,null,null,null,null,"Diel. Thickness (mil)"]
[null,"Freq","Dk","Df",null,null,null,"Freq","Dk","Df",null,null,null,"Freq","Dk","Df"]
[null,100000000,3.67,3.8999999999999998E-3,null,null,null,100000000,null,null,null,null,null,100000000]
[null,1000000000,3.65,4.0000000000000001E-3,null,null,null,1000000000,null,null,null,null,null,1000000000]
[null,2000000000,3.59,4.3E-3,null,null,null,2000000000,null,null,null,null,null,2000000000]
[null,5000000000,3.5760000000000001,4.8999999999999998E-3,null,null,null,5000000000,null,null,null,null,null,5000000000]
[null,10000000000,3.3494000000000002,5.4999999999999997E-3,null,null,null,10000000000,null,null,null,null,null,10000000000]
[null,20000000000,3,6.4999999999999997E-3,null,null,null,20000000000,null,null,null,null,null,20000000000]
[null,"Low Roughness",20,6.0000002122251317E-7]
[]
[]
[]
[]
[]
[]
[]
[]
[]
[]
[]
[]
[]
[]
[null,"DK fit to Second Order Equation","c2",{"$f":"INDEX(LINEST(C8:C13,B8:B13^{1,2}),1)","v":-3.8458222947541511E-22},null,null,null,"DK fit to Second Order Equation","c2",{"$f":" IF($J$3=0,\"n/a\", INDEX(LINEST(I8:I13,H8:H13^{1,2}),1))","v":"n/a"},null,null,null,"DK fit to Second Order Equation","c2",{"$f":" IF($P$3=0,\"n/a\", INDEX(LINEST(O8:O13,N8:N13^{1,2}),1) )","v":"n/a"}]
[null,null,"c1",{"$f":"INDEX(LINEST(C8:C13,B8:B13^{1,2}),1,2)","v":-2.6088176501468043E-11},null,null,null,null,"c1",{"$f":" IF($J$3=0,\"n/a\", INDEX(LINEST(I8:I13,H8:H13^{1,2}),1,2))","v":"n/a"},null,null,null,null,"c1",{"$f":" IF($P$3=0,\"n/a\", INDEX(LINEST(O8:O13,N8:N13^{1,2}),1,2) )","v":"n/a"}]
[null,null,"b",{"$f":"INDEX(LINEST(C8:C13,B8:B13^{1,2}),1,3)","v":3.6721986586916997},null,null,null,null,"b",{"$f":"IF($J$3=0,\"n/a\", INDEX(LINEST(I8:I13,H8:H13^{1,2}),1,3))","v":"n/a"},null,null,null,null,"b",{"$f":" IF($P$3=0,\"n/a\", INDEX(LINEST(O8:O13,N8:N13^{1,2}),1,3) )","v":"n/a"}]
[null,"Df fit to Second Order Equation","c2",{"$f":"INDEX(LINEST(D8:D13,B8:B13^{1,2}),1)","v":-3.8261070030546775E-24},null,null,null,"Df fit to Second Order Equation","c2",{"$f":" IF($J$3=0,\"n/a\", INDEX(LINEST(J8:J13,H8:H13^{1,2}),1))","v":"n/a"},null,null,null,"Df fit to Second Order Equation","c2",{"$f":" IF($P$3=0,\"n/a\", INDEX(LINEST(P8:P13,N8:N13^{1,2}),1) )","v":"n/a"}]
[null,null,"c1",{"$f":"INDEX(LINEST(D8:D13,B8:B13^{1,2}),1,2)","v":2.075003353829149E-13},null,null,null,null,"c1",{"$f":" IF($J$3=0,\"n/a\", INDEX(LINEST(J8:J13,H8:H13^{1,2}),1,2) )","v":"n/a"},null,null,null,null,"c1",{"$f":" IF($P$3=0,\"n/a\", INDEX(LINEST(P8:P13,N8:N13^{1,2}),1,2) )","v":"n/a"}]
[null,null,"b",{"$f":"INDEX(LINEST(D8:D13,B8:B13^{1,2}),1,3)","v":3.8703520324333256E-3},null,null,null,null,"b",{"$f":" IF($J$3=0,\"n/a\", INDEX(LINEST(J8:J13,H8:H13^{1,2}),1,3) )","v":"n/a"},null,null,null,null,"b",{"$f":" IF($P$3=0,\"n/a\", INDEX(LINEST(P8:P13,N8:N13^{1,2}),1,3) )","v":"n/a"}]
["δ (m)","Zo","Dk","Df","αcond","αdiel","Ksnowballs","Zo","Dk","Df","αcond","αdiel","Ksnowballs","Zo","Dk","Df","αcond","αdiel","Ksnowballs","Conn. Loss","Atotal (dB)","Frequency (GHz)"]
[{"$f":"SQRT(1/(PI()*56900000*0.00000125663))*SQRT(1/($V36*1000000000))","v":2.1099162582697643E-5},{"$f":" 94.15/( SQRT($C36)*( (($D$4/$D$6)/(1-$D$5/$D$6)) + ((((2/(1-$D$5/$D$6))*LN((1/(1-$D$5/$D$6))+1))-(((1/(1-$D$5/$D$6))-1)*LN((1/((1-$D$5/$D$6)^2))-1)))/PI() ) ) )","v":48.069843344374824},{"$f":"$D$29*(V36*10^9)^2 + $D$30*(V36*10^9) + $D$31","v":3.6719377384684622},{"$f":"$D$32*(V36*10^9)^2 + $D$33*(V36*10^9) + $D$34","v":3.8724266531764543E-3},{"$f":"IF(    1/(SQRT(PI()*(4*PI()*10^-7*0.999994)*59600000*$V36*10^9)) >= $D$5*0.0000254,                       (20*LOG(EXP(1))/2)  *  ((1/59600000)*39.3700787/($D$5*0.001)*(1/(0.001*$D$4)+1/(6*0.001*($D$6-$D$5)/2)))   *   (1/$B36),                          (20*LOG(EXP(1))/2)  *  ((SQRT(PI()*(4*PI()*10^-7*0.999994)/59600000)*SQRT($V36*10^9)*(1/(0.001*$D$4)+1/(6*0.001*($D$6-$D$5)/2))))/2  *  (1/$B36)     )","v":1.4586385972287752E-2},{"$f":" ( (20*LOG(EXP(1))/2) * 2*PI()*$V36*10^9 * $D36 *SQRT($C36) ) / (299792458*39.3700787 )","v":1.7155684419854444E-4},{"$f":"1 + ((3/2)*($C$14)*4*PI()*($D$14)^2)/(0.0000094*0.00000814)/(1+$A36/$D$14+$A36^2/2/($D$14)^2)","v":1.0027101669776839},{"$f":" IF($J$3=0,\"n/a\", 94.15/( SQRT($I36)*( (($J$4/$J$6)/(1-$J$5/$J$6)) + ((((2/(1-$J$5/$J$6))*LN((1/(1-$J$5/$J$6))+1))-(((1/(1-$J$5/$J$6))-1)*LN((1/((1-$J$5/$J$6)^2))-1)))/PI() ) ) ))","v":"n/a"},{"$f":" IF($J$3=0,\"n/a\", $J$29*(V36*10^9)^2 + $J$30*(V36*10^9) + $J$31)","v":"n/a"},{"$f":" IF($J$3=0,\"n/a\", $J$32*(V36*10^9)^2 + $J$33*(V36*10^9) + $J$34)","v":"n/a"},{"$f":" IF($J$3=0,\"n/a\", IF(    1/(SQRT(PI()*(4*PI()*10^-7*0.999994)*59600000*$V36*10^9)) >= $J$5*0.0000254,                       (20*LOG(EXP(1))/2)  *  ((1/59600000)*39.3700787/($J$5*0.001)*(1/(0.001*$J$4)+1/(6*0.001*($J$6-$J$5)/2)))   *   (1/$H36),                          (20*LOG(EXP(1))/2)  *  ((SQRT(PI()*(4*PI()*10^-7*0.999994)/59600000)*SQRT($V36*10^9)*(1/(0.001*$J$4)+1/(6*0.001*($J$6-$J$5)/2))))/2  *  (1/$H36)     ))","v":"n/a"},{"$f":" IF($J$3=0,\"n/a\", ( (20*LOG(EXP(1))/2) * 2*PI()*$V36*10^9 * $J36 *SQRT($I36) ) / (299792458*39.3700787 ))","v":"n/a"},{"$f":" IF($J$3=0,\"n/a\", 1 + ((3/2)*($I$14*$J$4*0.001*0.0000254*0.0254/0.0000094/0.00000814)*4*PI()*(0.0000005)^2)/($J$4*0.001*0.0000254*0.0254)/(1+$A36/$J$14+$A36^2/2/($J$14)^2))","v":"n/a"},{"$f":" IF($P$3=0,\"n/a\", 94.15/( SQRT($O36)*( (($P$4/$P$6)/(1-$P$5/$P$6)) + ((((2/(1-$P$5/$P$6))*LN((1/(1-$P$5/$P$6))+1))-(((1/(1-$P$5/$P$6))-1)*LN((1/((1-$P$5/$P$6)^2))-1)))/PI() ) ) ) )","v":"n/a"},{"$f":" IF($P$3=0,\"n/a\", $P$29*(V36*10^9)^2 + $P$30*(V36*10^9) + $P$31 )","v":"n/a"},{"$f":" IF($P$3=0,\"n/a\", $P$32*(V36*10^9)^2 + $P$33*(V36*10^9) + $P$34 )","v":"n/a"},{"$f":" IF($P$3=0,\"n/a\", IF(    1/(SQRT(PI()*(4*PI()*10^-7*0.999994)*59600000*$V36*10^9)) >= $P$5*0.0000254,                       (20*LOG(EXP(1))/2)  *  ((1/59600000)*39.3700787/($P$5*0.001)*(1/(0.001*$P$4)+1/(6*0.001*($P$6-$P$5)/2)))   *   (1/$N36),                          (20*LOG(EXP(1))/2)  *  ((SQRT(PI()*(4*PI()*10^-7*0.999994)/59600000)*SQRT($V36*10^9)*(1/(0.001*$P$4)+1/(6*0.001*($P$6-$P$5)/2))))/2  *  (1/$N36)     ))","v":"n/a"},{"$f":" IF($P$3=0,\"n/a\", ( (20*LOG(EXP(1))/2) * 2*PI()*$V36*10^9 * $P36 *SQRT($O36) ) / (299792458*39.3700787 ) )","v":"n/a"},{"$f":" IF($P$3=0,\"n/a\", 1 + ((3/2)*($O$14*$P$4*0.001*0.0000254*0.0254/0.0000094/0.00000814)*4*PI()*(0.0000005)^2)/($P$4*0.001*0.0000254*0.0254)/(1+$A36/$P$14+$A36^2/2/($P$14)^2) )","v":"n/a"},{"$f":"IF(AND($J$3=0, P$3=0), 0, 0.000009*SQRT($V36*1000000000)-0.000000000012*($V36*1000000000)+1.6E-21*($V36*1000000000)^2)","v":0},{"$f":"F36*$D$3 + E36*G36*$D$3    +    $T36    +   IF(OR(K36=\"n/a\",L36=\"n/a\",M36=\"n/a\"),0, L36*$D$3 + K36*M36*$J$3)    +    $T36    +    IF(OR(Q36=\"n/a\",R36=\"n/a\",S36=\"n/a\"),0,R36*$D$3 + Q36*S36*$P$3)","v":1.4797474358072143E-2},0.01]
[{"$f":"SQRT(1/(PI()*56900000*0.00000125663))*SQRT(1/($V37*1000000000))","v":9.4358323606463929E-6},{"$f":" 94.15/( SQRT($C37)*( (($D$4/$D$6)/(1-$D$5/$D$6)) + ((((2/(1-$D$5/$D$6))*LN((1/(1-$D$5/$D$6))+1))-(((1/(1-$D$5/$D$6))-1)*LN((1/((1-$D$5/$D$6)^2))-1)))/PI() ) ) )","v":48.076681323033796},3.6708932884110528,3.8807174839349638E-3,{"$f":"IF(    1/(SQRT(PI()*(4*PI()*10^-7*0.999994)*59600000*$V37*10^9)) >= $D$5*0.0000254,                       (20*LOG(EXP(1))/2)  *  ((1/59600000)*39.3700787/($D$5*0.001)*(1/(0.001*$D$4)+1/(6*0.001*($D$6-$D$5)/2)))   *   (1/$B37),                          (20*LOG(EXP(1))/2)  *  ((SQRT(PI()*(4*PI()*10^-7*0.999994)/59600000)*SQRT($V37*10^9)*(1/(0.001*$D$4)+1/(6*0.001*($D$6-$D$5)/2))))/2  *  (1/$B37)     )","v":1.205390033294872E-2},8.5949846488872375E-4,{"$f":"1 + ((3/2)*($C$14)*4*PI()*($D$14)^2)/(0.0000094*0.00000814)/(1+$A37/$D$14+$A37^2/2/($D$14)^2)","v":1.0126344858282457},{"$f":" IF($J$3=0,\"n/a\", 94.15/( SQRT($I37)*( (($J$4/$J$6)/(1-$J$5/$J$6)) + ((((2/(1-$J$5/$J$6))*LN((1/(1-$J$5/$J$6))+1))-(((1/(1-$J$5/$J$6))-1)*LN((1/((1-$J$5/$J$6)^2))-1)))/PI() ) ) ))","v":"n/a"},{"$f":" IF($J$3=0,\"n/a\", $J$29*(V37*10^9)^2 + $J$30*(V37*10^9) + $J$31)","v":"n/a"},{"$f":" IF($J$3=0,\"n/a\", $J$32*(V37*10^9)^2 + $J$33*(V37*10^9) + $J$34)","v":"n/a"},{"$f":" IF($J$3=0,\"n/a\", IF(    1/(SQRT(PI()*(4*PI()*10^-7*0.999994)*59600000*$V37*10^9)) >= $J$5*0.0000254,                       (20*LOG(EXP(1))/2)  *  ((1/59600000)*39.3700787/($J$5*0.001)*(1/(0.001*$J$4)+1/(6*0.001*($J$6-$J$5)/2)))   *   (1/$H37),                          (20*LOG(EXP(1))/2)  *  ((SQRT(PI()*(4*PI()*10^-7*0.999994)/59600000)*SQRT($V37*10^9)*(1/(0.001*$J$4)+1/(6*0.001*($J$6-$J$5)/2))))/2  *  (1/$H37)     ))","v":"n/a"},{"$f":" IF($J$3=0,\"n/a\", ( (20*LOG(EXP(1))/2) * 2*PI()*$V37*10^9 * $J37 *SQRT($I37) ) / (299792458*39.3700787 ))","v":"n/a"},{"$f":" IF($J$3=0,\"n/a\", 1 + ((3/2)*($I$14*$J$4*0.001*0.0000254*0.0254/0.0000094/0.00000814)*4*PI()*(0.0000005)^2)/($J$4*0.001*0.0000254*0.0254)/(1+$A37/$J$14+$A37^2/2/($J$14)^2))","v":"n/a"},{"$f":" IF($P$3=0,\"n/a\", 94.15/( SQRT($O37)*( (($P$4/$P$6)/(1-$P$5/$P$6)) + ((((2/(1-$P$5/$P$6))*LN((1/(1-$P$5/$P$6))+1))-(((1/(1-$P$5/$P$6))-1)*LN((1/((1-$P$5/$P$6)^2))-1)))/PI() ) ) ) )","v":"n/a"},{"$f":" IF($P$3=0,\"n/a\", $P$29*(V37*10^9)^2 + $P$30*(V37*10^9) + $P$31 )","v":"n/a"},{"$f":" IF($P$3=0,\"n/a\", $P$32*(V37*10^9)^2 + $P$33*(V37*10^9) + $P$34 )","v":"n/a"},{"$f":" IF($P$3=0,\"n/a\", IF(    1/(SQRT(PI()*(4*PI()*10^-7*0.999994)*59600000*$V37*10^9)) >= $P$5*0.0000254,                       (20*LOG(EXP(1))/2)  *  ((1/59600000)*39.3700787/($P$5*0.001)*(1/(0.001*$P$4)+1/(6*0.001*($P$6-$P$5)/2)))   *   (1/$N37),                          (20*LOG(EXP(1))/2)  *  ((SQRT(PI()*(4*PI()*10^-7*0.999994)/59600000)*SQRT($V37*10^9)*(1/(0.001*$P$4)+1/(6*0.001*($P$6-$P$5)/2))))/2  *  (1/$N37)     ))","v":"n/a"},{"$f":" IF($P$3=0,\"n/a\", ( (20*LOG(EXP(1))/2) * 2*PI()*$V37*10^9 * $P37 *SQRT($O37) ) / (299792458*39.3700787 ) )","v":"n/a"},{"$f":" IF($P$3=0,\"n/a\", 1 + ((3/2)*($O$14*$P$4*0.001*0.0000254*0.0254/0.0000094/0.00000814)*4*PI()*(0.0000005)^2)/($P$4*0.001*0.0000254*0.0254)/(1+$A37/$P$14+$A37^2/2/($P$14)^2) )","v":"n/a"},{"$f":"IF(AND($J$3=0, P$3=0), 0, 0.000009*SQRT($V37*1000000000)-0.000000000012*($V37*1000000000)+1.6E-21*($V37*1000000000)^2)","v":0},{"$f":"F37*$D$3 + E37*G37*$D$3    +    $T37    +   IF(OR(K37=\"n/a\",L37=\"n/a\",M37=\"n/a\"),0, L37*$D$3 + K37*M37*$J$3)    +    $T37    +    IF(OR(Q37=\"n/a\",R37=\"n/a\",S37=\"n/a\"),0,R37*$D$3 + Q37*S37*$P$3)","v":1.3065693630769169E-2},0.05]
[6.6721410483525333E-6,48.085244240163455,3.6695859952192582,3.8910638049015865E-3,1.704375367467878E-2,1.723272989536586E-3,1.023985178365481,"n/a","n/a","n/a","n/a","n/a","n/a","n/a","n/a","n/a","n/a","n/a","n/a",{"$f":"IF(AND($J$3=0, P$3=0), 0, 0.000009*SQRT($V38*1000000000)-0.000000000012*($V38*1000000000)+1.6E-21*($V38*1000000000)^2)","v":0},1.9175824136119859E-2,0.1]
[5.4477803534473765E-6,48.093824339725501,3.6682767791163164,3.9013909953331941E-3,2.0870525866132545E-2,2.5913076576171289E-3,1.0345754787465458,"n/a","n/a","n/a","n/a","n/a","n/a","n/a","n/a","n/a","n/a","n/a","n/a",0,2.4183441947263372E-2,0.15]
[4.7179161803231964E-6,48.10242164605296,3.666965640102227,3.9116990552297863E-3,2.4094900222319197E-2,3.4635865532660431E-3,1.0445899900913722,"n/a","n/a","n/a","n/a","n/a","n/a","n/a","n/a","n/a","n/a","n/a","n/a",0,2.8632878137751054E-2,0.2]
[4.2198325165395291E-6,48.111036183549899,3.6656525781769904,3.9219879845913633E-3,2.693409384732421E-2,4.3400937611097192E-3,1.0541341738220575,"n/a","n/a","n/a","n/a","n/a","n/a","n/a","n/a","n/a","n/a","n/a","n/a",0,3.2732242526504585E-2,0.25]
[2.983872187916595E-6,48.154368197720473,3.6590584248835967,3.9731456733740197E-3,3.8056284775963907E-2,8.7854974831224567E-3,1.0967172183165685,"n/a","n/a","n/a","n/a","n/a","n/a","n/a","n/a","n/a","n/a","n/a","n/a",0,5.0522480262080768E-2,0.5]
[2.4363214393592328E-6,48.198134692976105,3.6524161988115189,4.0238250987812939E-3,4.6566915910412364E-2,1.3334222036135372E-2,1.1333160692403537,"n/a","n/a","n/a","n/a","n/a","n/a","n/a","n/a","n/a","n/a","n/a","n/a",0,6.6109256132369995E-2,0.75]
[2.1099162582697645E-6,{"$f":" 94.15/( SQRT($C44)*( (($D$4/$D$6)/(1-$D$5/$D$6)) + ((((2/(1-$D$5/$D$6))*LN((1/(1-$D$5/$D$6))+1))-(((1/(1-$D$5/$D$6))-1)*LN((1/((1-$D$5/$D$6)^2))-1)))/PI() ) ) )","v":48.24233880107689},3.6457258999607562,4.0740262608131858E-3,5.372157303579228E-2,1.7984278722073237E-2,1.1657744463227553,"n/a","n/a","n/a","n/a","n/a","n/a","n/a","n/a","n/a","n/a","n/a","n/a",0,8.0611515783461443E-2,1]
[1.8871664721292784E-6,48.286983699856286,3.6389875283313091,4.1237491594696965E-3,6.0007012304696038E-2,2.2733679364259487E-2,1.1950913905622627,"n/a","n/a","n/a","n/a","n/a","n/a","n/a","n/a","n/a","n/a","n/a","n/a",0,9.4447543142965482E-2,1.25]
[1.7227394109210834E-6,48.332072613939161,3.632201083923178,4.1729937947508249E-3,6.5673064988504837E-2,2.7580436397164412E-2,1.221901199031604,"n/a","n/a","n/a","n/a","n/a","n/a","n/a","n/a","n/a","n/a","n/a","n/a",0,0.10782643325069892,1.5]
[1.5949467733010642E-6,48.377608815474886,3.6253665667363624,4.221760166656572E-3,7.086824878515284E-2,3.2522562956336494E-2,1.2466433237841124,"n/a","n/a","n/a","n/a","n/a","n/a","n/a","n/a","n/a","n/a","n/a","n/a",0,0.12086999217261882,1.75]
[1.4919360939582975E-6,48.423595624885841,3.6184839767708619,4.2700482751869369E-3,7.5689395869532383E-2,3.7558072968522545E-2,1.2696399169969692,"n/a","n/a","n/a","n/a","n/a","n/a","n/a","n/a","n/a","n/a","n/a","n/a",0,0.13365635125786637,2]
[1.4066108388465094E-6,48.470036411631717,3.6115533140266773,4.3178581203419195E-3,8.0203807935376847E-2,4.2684981241982868E-2,1.2911367673875791,"n/a","n/a","n/a","n/a","n/a","n/a","n/a","n/a","n/a","n/a","n/a","n/a",0,0.1462390665518396,2.25]
[1.3344282096705067E-6,48.516934594989962,3.6045745785038084,4.3651897021215209E-3,8.4460515184809584E-2,4.7901303557007197E-2,1.3113271014286632,"n/a","n/a","n/a","n/a","n/a","n/a","n/a","n/a","n/a","n/a","n/a","n/a",0,0.15865666611947515,2.5]
[1.2723273759548013E-6,48.564293644852846,3.5975477702022549,4.4120430205257409E-3,8.8496551117146466E-2,5.3205056756637843E-2,1.3303664169765954,"n/a","n/a","n/a","n/a","n/a","n/a","n/a","n/a","n/a","n/a","n/a","n/a",0,0.1709378963811421,2.75]
[1.2181607196796164E-6,48.612117082541403,3.590472889122017,4.4584180755545787E-3,9.2340701042728984E-2,5.8594258837605842E-2,1.348382227558961,"n/a","n/a","n/a","n/a","n/a","n/a","n/a","n/a","n/a","n/a","n/a","n/a",0,0.18310481900395681,3]
[1.1703709624810395E-6,48.660408481636772,3.5833499352630946,4.5043148672080343E-3,9.6015866461076543E-2,6.406692904148667E-2,1.3654807339577035,"n/a","n/a","n/a","n/a","n/a","n/a","n/a","n/a","n/a","n/a","n/a","n/a",0,0.19517474484834232,3.25]
[1.1277976790327854E-6,48.709171468829325,3.5761789086254878,4.5497333954861077E-3,9.9540623104060699E-2,6.9621087946081683E-2,1.3817515475526074,"n/a","n/a","n/a","n/a","n/a","n/a","n/a","n/a","n/a","n/a","n/a","n/a",0,0.20716149796446839,3.5]
[1.0895560706894753E-6,48.758409724786027,3.5689598092091965,4.5946736603887997E-3,0.10293028531375886,7.5254757557031648E-2,1.3972711282426042,"n/a","n/a","n/a","n/a","n/a","n/a","n/a","n/a","n/a","n/a","n/a","n/a",0,0.21907627344772065,3.75]
[1.0549581291348823E-6,48.808126985036452,3.5616926370142208,4.6391356619161104E-3,0.10619765548938333,8.0965961399668829E-2,1.4121053457789294,"n/a","n/a","n/a","n/a","n/a","n/a","n/a","n/a","n/a","n/a","n/a","n/a",0,0.2309282384254161,4]
[1.0234597169475565E-6,48.858327040877896,3.554377392040561,4.6831194000680389E-3,0.10935356554152012,8.6752724611114287E-2,1.4263114264024506,"n/a","n/a","n/a","n/a","n/a","n/a","n/a","n/a","n/a","n/a","n/a","n/a",0,0.24272496466083371,4.25]
[9.9462406263886487E-7,48.909013740300189,3.5470140742882164,4.7266248748445852E-3,0.11240727685103935,9.2613074032626905E-2,1.4399394580111542,"n/a","n/a","n/a","n/a","n/a","n/a","n/a","n/a","n/a","n/a","n/a","n/a",0,0.25447274733802228,4.5]
[9.6809597359277546E-7,48.960190988930485,3.5396026837571872,4.7696520862457502E-3,0.11536678147282595,9.8545038302210966E-2,1.4530335716331697,"n/a","n/a","n/a","n/a","n/a","n/a","n/a","n/a","n/a","n/a","n/a","n/a",0,0.26617684483349463,4.75]
[9.4358323606463922E-7,49.011862750998738,3.5321432204474741,4.812201034271533E-3,0.11823903285434252,0.10454664794748889,1.4656328812177946,"n/a","n/a","n/a","n/a","n/a","n/a","n/a","n/a","n/a","n/a","n/a","n/a",0,0.27784166234220442,5]
[9.2084294890849438E-7,49.064033050324205,3.5246356843590765,4.8542717189219344E-3,0.12103012524388206,0.11061593547884592,1.4777722400643341,"n/a","n/a","n/a","n/a","n/a","n/a","n/a","n/a","n/a","n/a","n/a","n/a",0,0.28947089477576443,5.25]
[8.9967131542692595E-7,49.116705971323654,3.517080075491994,4.8958641401969536E-3,0.12374543508649632,0.11675093548285453,1.4894828561376459,"n/a","n/a","n/a","n/a","n/a","n/a","n/a","n/a","n/a","n/a","n/a","n/a",0,0.30106763956948474,5.5]
[8.7989590460523109E-7,49.169885660041771,3.5094763938462274,4.9369782980965907E-3,0.12638973381413865,0.12294968471598446,1.5007927973877773,"n/a","n/a","n/a","n/a","n/a","n/a","n/a","n/a","n/a","n/a","n/a","n/a",0,0.31263448688800216,5.75]
[8.6136970546054169E-7,49.223576325204192,3.5018246394217765,4.9776141926208464E-3,0.12896727880290582,0.12921022219860628,1.5117274103354454,"n/a","n/a","n/a","n/a","n/a","n/a","n/a","n/a","n/a","n/a","n/a","n/a",0,0.32417359260133249,6]
[8.4396650330790571E-7,49.277782239294069,3.494124812218641,5.0177718237697198E-3,0.13148188745256195,0.13553058930929551,1.5223096695474416,"n/a","n/a","n/a","n/a","n/a","n/a","n/a","n/a","n/a","n/a","n/a","n/a",0,0.33568673794867898,6.25]
[8.2757724407416945E-7,49.332507739652364,3.4863769122368211,5.0574511915432128E-3,0.13393699806656506,0.141908829879445,1.532560471518188,"n/a","n/a","n/a","n/a","n/a","n/a","n/a","n/a","n/a","n/a","n/a","n/a",0,0.34717537879007054,6.5]
[8.1210714645307761E-7,49.387757229602848,3.4785809394763167,5.0966522959413219E-3,0.13633572029919425,0.14834299028819231,1.542498883438991,"n/a","n/a","n/a","n/a","n/a","n/a","n/a","n/a","n/a","n/a","n/a","n/a",0,0.35864068662255,6.75]
[7.9747338665053211E-7,49.443535179602158,3.4707368939371279,5.1353751369640505E-3,0.13868087727595468,{"$f":" ( (20*LOG(EXP(1))/2) * 2*PI()*$V68*10^9 * $D68 *SQRT($C68) ) / (299792458*39.3700787 )","v":0.15483111955767037},1.5521423550662146,"n/a","n/a","n/a","n/a","n/a","n/a","n/a","n/a","n/a","n/a","n/a","n/a",0,0.37008358301541933,7]
[7.8360322620932773E-7,49.499846128415776,3.4628447756192551,5.1736197146113969E-3,0.14097504100853078,0.16137126944858887,1.5615069001814357,"n/a","n/a","n/a","n/a","n/a","n/a","n/a","n/a","n/a","n/a","n/a","n/a",0,0.38150476873677053,7.25]
[7.7043248606749737E-7,49.556694684320433,3.4549045845226973,5.211386028883362E-3,0.14322056236509739,0.16796149455615397,1.5706072528224344,"n/a","n/a","n/a","n/a","n/a","n/a","n/a","n/a","n/a","n/a","n/a","n/a",0,0.39290474856008373,7.5]
[7.5790429363548773E-7,49.61408552633381,3.4469163206474551,5.2486740797799449E-3,0.14541959658577958,0.17459985240633452,1.5794570024487857,"n/a","n/a","n/a","n/a","n/a","n/a","n/a","n/a","n/a","n/a","n/a","n/a",0,0.40428385252702159,7.75]
[7.4596804697914876E-7,49.672023405472046,3.4388799839935289,5.2854838673011455E-3,0.14757412512711832,0.18128440355248246,1.5880687114145648,"n/a","n/a","n/a","n/a","n/a","n/a","n/a","n/a","n/a","n/a","n/a","n/a",0,0.41564225428123702,8]
[7.345785530048347E-7,49.730513146035982,3.4307955745609178,5.321815391446964E-3,0.14968597446138449,0.18801321167231633,1.5964540174987294,"n/a","n/a","n/a","n/a","n/a","n/a","n/a","n/a","n/a","n/a","n/a","n/a",0,0.42697998696440576,8.25]
[7.2369530612488174E-7,49.78955964692674,3.4226630923496226,5.3576686522174019E-3,0.15175683233422982,0.19478434366527506,1.6046237237509653,"n/a","n/a","n/a","n/a","n/a","n/a","n/a","n/a","n/a","n/a","n/a","n/a",0,0.43829695707007776,8.5]
[7.1328188111902521E-7,49.849167882991573,3.414482537359643,5.3930436496124577E-3,0.15378826188860867,0.20159586975025098,1.6125878775175106,"n/a","n/a","n/a","n/a","n/a","n/a","n/a","n/a","n/a","n/a","n/a","n/a",0,0.44959295657630949,8.75]
[7.0330541942325471E-7,49.90934290640066,3.4062539095909785,5.4279403836321304E-3,0.15578171398769025,0.20844586356371125,1.6203558401954212,"n/a","n/a","n/a","n/a","n/a","n/a","n/a","n/a","n/a","n/a","n/a","n/a",0,0.46086767361931791,9]
[6.9373619231731582E-7,49.970089848055714,3.39797720904363,5.4623588542764227E-3,0.15773853800982904,0.21533240225821534,1.6279363490081196,"n/a","n/a","n/a","n/a","n/a","n/a","n/a","n/a","n/a","n/a","n/a","n/a",0,0.47212070192381494,9.25]
[6.8454722776684442E-7,50.031413919031372,3.389652435717597,5.4962990615453327E-3,0.15965999134102321,0.22225356660133702,1.6353375718870629,"n/a","n/a","n/a","n/a","n/a","n/a","n/a","n/a","n/a","n/a","n/a","n/a",0,0.48335154916847545,9.5]
[6.7571399024014949E-7,50.093320412050055,3.3812795896128796,5.5297610054388605E-3,0.16154724775199214,0.22920744107500199,1.6425671563741284,"n/a","n/a","n/a","n/a","n/a","n/a","n/a","n/a","n/a","n/a","n/a","n/a",0,0.49455964443505851,9.75]
[6.6721410483525333E-7,50.155814702991385,3.3728586707294776,5.562744685957007E-3,0.16340140481602683,0.23619211397524789,1.6496322733192412,"n/a","n/a","n/a","n/a","n/a","n/a","n/a","n/a","n/a","n/a","n/a","n/a",0,0.50574434486546782,10]
[6.5902711864784168E-7,50.218902252437019,3.3643896790673913,5.5952501030997713E-3,0.16522349049855856,0.24320567751241629,1.6565396560319388,"n/a","n/a","n/a","n/a","n/a","n/a","n/a","n/a","n/a","n/a","n/a","n/a",0,0.51690494163129475,10.25]
[6.5113429358101388E-7,50.282588607251846,3.3558726146266209,5.6272772568671543E-3,0.16701446902876757,0.25024622791178824,1.6632956354492729,"n/a","n/a","n/a","n/a","n/a","n/a","n/a","n/a","n/a","n/a","n/a","n/a",0,0.52804066530421512,10.5]
[6.4351842581531547E-7,50.346879402202653,3.3473074774071656,5.658826147259155E-3,0.16877524614658926,0.25731186551466972,1.6699061718021118,"n/a","n/a","n/a","n/a","n/a","n/a","n/a","n/a","n/a","n/a","n/a","n/a",0,0.53915069070227972,10.75]
[6.3616368797740067E-7,50.411780361615207,3.3386942674090259,5.6898967742757735E-3,0.1705066738044532,0.26440069487993878,1.6763768831944934,"n/a","n/a","n/a","n/a","n/a","n/a","n/a","n/a","n/a","n/a","n/a","n/a",0,0.55023414127610826,11]
[6.2905549070975945E-7,50.477297301070827,3.3300329846322021,5.7204891379170108E-3,0.17220955439144309,0.27151082488606482,1.6827130714539524,"n/a","n/a","n/a","n/a","n/a","n/a","n/a","n/a","n/a","n/a","n/a","n/a",0,0.56129009308980649,11.25]
[6.2218036088463037E-7,50.543436129143615,3.3213236290766934,5.7506032381828658E-3,0.17388464453784985,0.27864036883360632,1.6889197455627918,"n/a","n/a","n/a","n/a","n/a","n/a","n/a","n/a","n/a","n/a","n/a","n/a",0,0.5723175784437482,11.5]
[6.1552583414757737E-7,50.61020284917938,3.3125662007425007,5.7802390750733394E-3,0.17553265854994701,0.28578744454820348,1.6950016429395687,"n/a","n/a","n/a","n/a","n/a","n/a","n/a","n/a","n/a","n/a","n/a","n/a",0,0.583315589179914,11.75]
[6.0908035983980821E-7,50.677603561117593,3.3037606996296236,5.8093966485884309E-3,0.17715427151796842,0.29295017448406907,1.7009632488054263,"n/a","n/a","n/a","n/a","n/a","n/a","n/a","n/a","n/a","n/a","n/a","n/a",0,0.59428307970503125,12]
[6.0283321664850407E-7,50.745644463357358,3.2949071257380615,5.8380759587281401E-3,0.17875012213448357,0.30012668582799473,1.7068088138402939,"n/a","n/a","n/a","n/a","n/a","n/a","n/a","n/a","n/a","n/a","n/a","n/a",0,0.60521896976216039,12.25]
[5.9677443758331894E-7,50.814331854668893,3.2860054790678155,5.8662770054924689E-3,0.18032081525545929,0.30731511060387812,1.7125423703086071,"n/a","n/a","n/a","n/a","n/a","n/a","n/a","n/a","n/a","n/a","n/a","n/a",0,0.61612214697744283,12.5]
[5.9089474308440992E-7,50.883672136151681,3.277055759618885,5.8939997888814146E-3,0.18186692423212414,0.31451358577778532,1.7181677468123717,"n/a","n/a","n/a","n/a","n/a","n/a","n/a","n/a","n/a","n/a","n/a","n/a",0,0.62699146920539039,12.75]
[5.8767708929387565E-7,50.922790296681107,3.2720229185377545,5.9093156421368576E-3,0.18272221080996648,0.31854842914064269,1.7212720682571556,"n/a","n/a","n/a","n/a","n/a","n/a","n/a","n/a","n/a","n/a","n/a","n/a",0,0.63306306685803371,12.89]
[5.7963857424088525E-7,51.024337497761614,3.2590121023849705,5.9480105655331612E-3,0.1848875382139254,0.3289332605289792,1.7291083360277169,"n/a","n/a","n/a","n/a","n/a","n/a","n/a","n/a","n/a","n/a","n/a","n/a",0,0.64862384408232066,13.25]
[5.742464703070279E-7,51.095675910038103,3.2499181645999866,5.974298558795962E-3,0.18636305064598144,0.33615075970250241,1.7344303038599245,"n/a","n/a","n/a","n/a","n/a","n/a","n/a","n/a","n/a","n/a","n/a","n/a",0,0.65938448226267443,13.5]
[5.6900210045377341E-7,51.167693881049786,3.2407761540363182,6.0001082886833807E-3,0.18781599719955347,0.34337090868056747,1.7396576238752146,"n/a","n/a","n/a","n/a","n/a","n/a","n/a","n/a","n/a","n/a","n/a","n/a",0,0.6701064400944966,13.75]
[5.6389883951639272E-7,51.240398354645272,3.2315860706939659,6.0254397551954171E-3,0.18924682221758157,0.35059187073550352,1.7447932884932795,"n/a","n/a","n/a","n/a","n/a","n/a","n/a","n/a","n/a","n/a","n/a","n/a",0,0.68078845600942073,14]
[5.5893047095518174E-7,51.313796389810236,3.2223479145729286,6.0502929583320722E-3,0.1906559488999395,0.3578118147240385,1.7498401529212013,"n/a","n/a","n/a","n/a","n/a","n/a","n/a","n/a","n/a","n/a","n/a","n/a",0,0.69142924950244544,14.25]
[5.5409115501227172E-7,51.387895162992521,3.2130616856732068,6.074667898093346E-3,0.19204378057412327,0.36502891519642527,1.7548009434131009,"n/a","n/a","n/a","n/a","n/a","n/a","n/a","n/a","n/a","n/a","n/a","n/a",0,0.70202752252451539,14.5]
[5.4937539984975065E-7,51.46270197048613,3.2037273839948011,6.0985645744792375E-3,0.19341070186765516,0.37224135250619717,1.7596782649145826,"n/a","n/a","n/a","n/a","n/a","n/a","n/a","n/a","n/a","n/a","n/a","n/a",0,0.71258196078458425,14.75]
[5.4477803534473765E-7,51.538224230875706,{"$f":"$D$29*(V100*10^9)^2 + $D$30*(V100*10^9) + $D$31","v":3.1943450095377104},{"$f":"$D$32*(V100*10^9)^2 + $D$33*(V100*10^9) + $D$34","v":6.121982987489746E-3},0.19475707979130369,{"$f":" ( (20*LOG(EXP(1))/2) * 2*PI()*$V100*10^9 * $D100 *SQRT($C100) ) / (299792458*39.3700787 )","v":0.37944731292056627},1.7644746081464957,"n/a","n/a","n/a","n/a","n/a","n/a","n/a","n/a","n/a","n/a","n/a","n/a",0,0.72309123496908256,15]
[{"$f":"SQRT(1/(PI()*56900000*0.00000125663))*SQRT(1/($V101*1000000000))","v":5.4029418925710195E-7},{"$f":" 94.15/( SQRT($C101)*( (($D$4/$D$6)/(1-$D$5/$D$6)) + ((((2/(1-$D$5/$D$6))*LN((1/(1-$D$5/$D$6))+1))-(((1/(1-$D$5/$D$6))-1)*LN((1/((1-$D$5/$D$6)^2))-1)))/PI() ) ) )","v":51.614469487543275},3.1849145623019357,6.144923137124874E-3,{"$f":"IF(    1/(SQRT(PI()*(4*PI()*10^-7*0.999994)*59600000*$V101*10^9)) >= $D$5*0.0000254,                       (20*LOG(EXP(1))/2)  *  ((1/59600000)*39.3700787/($D$5*0.001)*(1/(0.001*$D$4)+1/(6*0.001*($D$6-$D$5)/2)))   *   (1/$B101),                          (20*LOG(EXP(1))/2)  *  ((SQRT(PI()*(4*PI()*10^-7*0.999994)/59600000)*SQRT($V101*10^9)*(1/(0.001*$D$4)+1/(6*0.001*($D$6-$D$5)/2))))/2  *  (1/$B101)     )","v":0.19608326474123908},0.38664498873147835,{"$f":"1 + ((3/2)*($C$14)*4*PI()*($D$14)^2)/(0.0000094*0.00000814)/(1+$A101/$D$14+$A101^2/2/($D$14)^2)","v":1.7691923561769383},{"$f":" IF($J$3=0,\"n/a\", 94.15/( SQRT($I101)*( (($J$4/$J$6)/(1-$J$5/$J$6)) + ((((2/(1-$J$5/$J$6))*LN((1/(1-$J$5/$J$6))+1))-(((1/(1-$J$5/$J$6))-1)*LN((1/((1-$J$5/$J$6)^2))-1)))/PI() ) ) ))","v":"n/a"},{"$f":" IF($J$3=0,\"n/a\", $J$29*(V101*10^9)^2 + $J$30*(V101*10^9) + $J$31)","v":"n/a"},{"$f":" IF($J$3=0,\"n/a\", $J$32*(V101*10^9)^2 + $J$33*(V101*10^9) + $J$34)","v":"n/a"},{"$f":" IF($J$3=0,\"n/a\", IF(    1/(SQRT(PI()*(4*PI()*10^-7*0.999994)*59600000*$V101*10^9)) >= $J$5*0.0000254,                       (20*LOG(EXP(1))/2)  *  ((1/59600000)*39.3700787/($J$5*0.001)*(1/(0.001*$J$4)+1/(6*0.001*($J$6-$J$5)/2)))   *   (1/$H101),                          (20*LOG(EXP(1))/2)  *  ((SQRT(PI()*(4*PI()*10^-7*0.999994)/59600000)*SQRT($V101*10^9)*(1/(0.001*$J$4)+1/(6*0.001*($J$6-$J$5)/2))))/2  *  (1/$H101)     ))","v":"n/a"},{"$f":" IF($J$3=0,\"n/a\", ( (20*LOG(EXP(1))/2) * 2*PI()*$V101*10^9 * $J101 *SQRT($I101) ) / (299792458*39.3700787 ))","v":"n/a"},{"$f":" IF($J$3=0,\"n/a\", 1 + ((3/2)*($I$14*$J$4*0.001*0.0000254*0.0254/0.0000094/0.00000814)*4*PI()*(0.0000005)^2)/($J$4*0.001*0.0000254*0.0254)/(1+$A101/$J$14+$A101^2/2/($J$14)^2))","v":"n/a"},{"$f":" IF($P$3=0,\"n/a\", 94.15/( SQRT($O101)*( (($P$4/$P$6)/(1-$P$5/$P$6)) + ((((2/(1-$P$5/$P$6))*LN((1/(1-$P$5/$P$6))+1))-(((1/(1-$P$5/$P$6))-1)*LN((1/((1-$P$5/$P$6)^2))-1)))/PI() ) ) ) )","v":"n/a"},{"$f":" IF($P$3=0,\"n/a\", $P$29*(V101*10^9)^2 + $P$30*(V101*10^9) + $P$31 )","v":"n/a"},{"$f":" IF($P$3=0,\"n/a\", $P$32*(V101*10^9)^2 + $P$33*(V101*10^9) + $P$34 )","v":"n/a"},{"$f":" IF($P$3=0,\"n/a\", IF(    1/(SQRT(PI()*(4*PI()*10^-7*0.999994)*59600000*$V101*10^9)) >= $P$5*0.0000254,                       (20*LOG(EXP(1))/2)  *  ((1/59600000)*39.3700787/($P$5*0.001)*(1/(0.001*$P$4)+1/(6*0.001*($P$6-$P$5)/2)))   *   (1/$N101),                          (20*LOG(EXP(1))/2)  *  ((SQRT(PI()*(4*PI()*10^-7*0.999994)/59600000)*SQRT($V101*10^9)*(1/(0.001*$P$4)+1/(6*0.001*($P$6-$P$5)/2))))/2  *  (1/$N101)     ))","v":"n/a"},{"$f":" IF($P$3=0,\"n/a\", ( (20*LOG(EXP(1))/2) * 2*PI()*$V101*10^9 * $P101 *SQRT($O101) ) / (299792458*39.3700787 ) )","v":"n/a"},{"$f":" IF($P$3=0,\"n/a\", 1 + ((3/2)*($O$14*$P$4*0.001*0.0000254*0.0254/0.0000094/0.00000814)*4*PI()*(0.0000005)^2)/($P$4*0.001*0.0000254*0.0254)/(1+$A101/$P$14+$A101^2/2/($P$14)^2) )","v":"n/a"},0,{"$f":"F101*$D$3 + E101*G101*$D$3    +    $T101    +   IF(OR(K101=\"n/a\",L101=\"n/a\",M101=\"n/a\"),0, L101*$D$3 + K101*M101*$J$3)    +    $T101    +    IF(OR(Q101=\"n/a\",R101=\"n/a\",S101=\"n/a\"),0,R101*$D$3 + Q101*S101*$P$3)","v":0.73355400188589748},15.25]
[5.359192655200537E-7,51.691445411239279,3.1754360422874766,6.1673850233846198E-3,0.19738959142737955,0.39383257836733571,1.7738337905254862,"n/a","n/a","n/a","n/a","n/a","n/a","n/a","n/a","n/a","n/a","n/a","n/a",{"$f":"IF(AND($J$3=0, P$3=0), 0, 0.000009*SQRT($V102*1000000000)-0.000000000012*($V102*1000000000)+1.6E-21*($V102*1000000000)^2)","v":0},0.74396890553924133,15.5]
[5.3164892443368811E-7,51.769159802719678,3.165909449494333,6.1893686462689843E-3,0.19867637973443214,0.40100828650540532,1.7784010968392683,"n/a","n/a","n/a","n/a","n/a","n/a","n/a","n/a","n/a","n/a","n/a","n/a",0,0.75433457814117444,15.75]
[5.2747906456744114E-7,51.847620595451296,3.1563347839225049,6.2108740057779666E-3,0.19994393552145837,0.40817032418492211,1.7828963701766081,"n/a","n/a","n/a","n/a","n/a","n/a","n/a","n/a","n/a","n/a","n/a","n/a",0,0.76464964106495592,16]
[5.2340580619989208E-7,51.926835858387243,3.1467120455719924,6.2319011019115666E-3,0.20119255136521191,0.41531690892090611,1.7873216199305177,"n/a","n/a","n/a","n/a","n/a","n/a","n/a","n/a","n/a","n/a","n/a","n/a",0,0.77491270574493054,16.25]
[5.1942547614392036E-7,52.006813798814818,3.1370412344427954,6.2524499346697853E-3,0.2024225072519662,0.42244626481870406,1.791678774421249,"n/a","n/a","n/a","n/a","n/a","n/a","n/a","n/a","n/a","n/a","n/a","n/a",0,0.78512237452718325,16.5]
[5.155345938223035E-7,52.087562765278037,3.1273223505349139,6.2725205040526227E-3,0.20363407122209365,0.42955662268927353,1.7959696851843663,"n/a","n/a","n/a","n/a","n/a","n/a","n/a","n/a","n/a","n/a","n/a","n/a",0,0.79527724147482792,16.75]
[5.1172985847377825E-7,52.169091250576912,3.117555393848348,6.2921128100600771E-3,0.2048274999712433,0.43664622016522292,1.800196130978355,"n/a","n/a","n/a","n/a","n/a","n/a","n/a","n/a","n/a","n/a","n/a","n/a",0,0.80537589313142421,17]
[5.0800813738267945E-7,52.25140789484621,3.1077403643830976,6.3112268526921509E-3,0.20600303941159775,0.44371330181762453,1.8043598215335959,"n/a","n/a","n/a","n/a","n/a","n/a","n/a","n/a","n/a","n/a","n/a","n/a",0,0.81541690924571331,17.25]
[5.043664550367596E-7,52.334521488715843,3.0978772621391633,6.3298626319488408E-3,0.20716092519636409,0.45075611927361453,1.8084624010625543,"n/a","n/a","n/a","n/a","n/a","n/a","n/a","n/a","n/a","n/a","n/a","n/a",0,0.82539886346057134,17.5]
[5.0080198312791228E-7,52.418440976555651,3.087966087116544,6.3480201478301503E-3,0.20830138321036301,0.45777293133479852,1.8125054515492849,"n/a","n/a","n/a","n/a","n/a","n/a","n/a","n/a","n/a","n/a","n/a","n/a",0,0.83532032396883815,17.75]
[4.9731203131943244E-7,52.503175459807181,3.0780068393152407,6.3656994003360784E-3,0.20942463002931677,0.46476200409647689,1.8164904958347519,"n/a","n/a","n/a","n/a","n/a","n/a","n/a","n/a","n/a","n/a","n/a","n/a",0,0.84517985413843999,18]
[4.9389403871132103E-7,52.588734200405199,3.0679995187352525,6.3829003894666243E-3,0.21053087335020396,0.4717216110677091,1.8204190005130476,"n/a","n/a","n/a","n/a","n/a","n/a","n/a","n/a","n/a","n/a","n/a","n/a",0,0.85497601310902638,18.25]
[4.9054556594210902E-7,52.675126624291757,3.0579441253765802,6.399623115221788E-3,0.21162031239484039,0.47865003329223277,1.8242923786522915,"n/a","n/a","n/a","n/a","n/a","n/a","n/a","n/a","n/a","n/a","n/a","n/a",0,0.86470735636215723,18.5]
[4.8726428787184659E-7,52.762362325025947,3.0478406592392231,6.4158675776015694E-3,0.21269313828865261,0.48554555947025635,1.8281119923528428,"n/a","n/a","n/a","n/a","n/a","n/a","n/a","n/a","n/a","n/a","n/a","n/a",0,0.87437243626690386,18.75]
[4.8404798679638773E-7,52.850451067492152,3.0376891203231819,6.4316337766059705E-3,0.21374953441644454,0.49240648608114207,1.8318791551543865,"n/a","n/a","n/a","n/a","n/a","n/a","n/a","n/a","n/a","n/a","n/a","n/a",0,0.88396980260258196,19]
[4.8089454614796939E-7,52.939402791710236,3.0274895086284563,6.4469217122349884E-3,0.2147896767568023,0.49923111750699939,1.8355951343025261,"n/a","n/a","n/a","n/a","n/a","n/a","n/a","n/a","n/a","n/a","n/a","n/a",0,0.893498003060198,19.25]
[4.7780194464143038E-7,53.029227616750774,3.0172418241550463,6.461731384488625E-3,0.2158137341966431,0.5060177661572075,1.8392611528846277,"n/a","n/a","n/a","n/a","n/a","n/a","n/a","n/a","n/a","n/a","n/a","n/a",0,0.90295558372406193,19.5]
[4.7476825082928397E-7,53.119935844758892,3.0069460669029517,6.4760627933668794E-3,0.21682186882729104,0.5127647525938841,1.8428783918438914,"n/a","n/a","n/a","n/a","n/a","n/a","n/a","n/a","n/a","n/a","n/a","n/a",0,0.91234108953490933,19.75]
[4.7179161803231961E-7,53.211537965090265,2.9966022368721728,6.4899159388697525E-3,0.21781423622334631,0.5194704056583237,1.8464479918799084,"n/a","n/a","n/a","n/a","n/a","n/a","n/a","n/a","n/a","n/a","n/a","n/a",0,0.92165306473577746,20]
[4.6887027961550316E-7,53.304044658562823,2.9862103340627093,6.5032908209972434E-3,0.21879098570551397,0.52613306259842429,1.8499710552433135,"n/a","n/a","n/a","n/a","n/a","n/a","n/a","n/a","n/a","n/a","n/a","n/a",0,0.93089005330177876,20.25]
[4.6600254458172029E-7,53.397466801828202,2.9757703584745618,6.5161874397493529E-3,0.21975226058846403,0.53275106919712145,1.8534486474315508,"n/a","n/a","n/a","n/a","n/a","n/a","n/a","n/a","n/a","n/a","n/a","n/a",0,0.94005059935483581,20.5]
[4.6318679345839419E-7,53.491815471866843,2.9652823101077295,6.5286057951260803E-3,0.22069819841470861,0.5393227799018534,1.8568817987922379,"n/a","n/a","n/a","n/a","n/a","n/a","n/a","n/a","n/a","n/a","n/a","n/a",0,0.94913324756436368,20.75]
[4.6042147445424719E-7,53.587101950610794,2.9547461889622126,6.5405458871274254E-3,0.22162893117540658,0.54584655795507919,1.8602715060401127,"n/a","n/a","n/a","n/a","n/a","n/a","n/a","n/a","n/a","n/a","n/a","n/a",0,0.95813654353481326,21]
[4.5770509986548598E-7,53.683337729698657,2.9441619950380118,6.5520077157533892E-3,0.2225445855189343,0.55232077552586845,1.8636187336931047,"n/a","n/a","n/a","n/a","n/a","n/a","n/a","n/a","n/a","n/a","n/a","n/a",0,0.96705903418092165,21.25]
[4.5503624271250183E-7,53.78053451536708,2.933529728335126,6.5629912810039716E-3,0.22344528294799748,0.55874381384259042,1.8669244154326612,"n/a","n/a","n/a","n/a","n/a","n/a","n/a","n/a","n/a","n/a","n/a","n/a",0,0.97589926809146621,21.5]
[4.5241353358981452E-7,53.878704233483376,2.9228493888535563,6.5734965828791719E-3,0.22433114000599935,0.56511406332672209,1.8701894553930769,"n/a","n/a","n/a","n/a","n/a","n/a","n/a","n/a","n/a","n/a","n/a","n/a",0,0.98465579588225016,21.75]
[4.4983565771346298E-7,53.977859034724283,2.912120976593302,6.583523621378989E-3,0.22520226845332875,0.57142992372780144,1.8734147293842365,"n/a","n/a","n/a","n/a","n/a","n/a","n/a","n/a","n/a","n/a","n/a","n/a",0,0.99332717053901054,22]
[4.4730135215138037E-7,54.078011299905619,2.9013444915543629,6.5930723965034257E-3,0.22605877543418068,0.57768980425954841,1.8766010860518572,"n/a","n/a","n/a","n/a","n/a","n/a","n/a","n/a","n/a","n/a","n/a","n/a",0,1.0019119477508847,22.25]
[4.4480940322350217E-7,54.179173645468261,2.8905199337367398,6.6021429082524802E-3,0.22690076363447717,0.5838921237371808,1.8797493479790359,"n/a","n/a","n/a","n/a","n/a","n/a","n/a","n/a","n/a","n/a","n/a","n/a",0,1.0104086862350345,22.5]
[4.4235864405944816E-7,54.281358929125872,2.8796473031404322,6.6107351566261525E-3,0.22772833143141583,0.59003531071594784,1.8828603127326269,"n/a","n/a","n/a","n/a","n/a","n/a","n/a","n/a","n/a","n/a","n/a","n/a",0,1.0188159480529828,22.75]
[4.3994795230261554E-7,54.384580255679793,2.8687265997654401,6.6188491416244444E-3,0.22854157303513536,{"$f":" ( (20*LOG(EXP(1))/2) * 2*PI()*$V132*10^9 * $D132 *SQRT($C132) ) / (299792458*39.3700787 )","v":0.59611780363091327},1.8859347538577391,"n/a","n/a","n/a","n/a","n/a","n/a","n/a","n/a","n/a","n/a","n/a","n/a",0,1.0271322989191918,23]
[4.3757624795042192E-7,54.488850983007303,2.8577578236117636,6.6264848632473531E-3,0.22934057862295074,0.60213805093800676,1.8889734218234127,"n/a","n/a","n/a","n/a","n/a","n/a","n/a","n/a","n/a","n/a","n/a","n/a",0,1.0353563085023634,23.25]
[4.3524249132125811E-7,54.594184728229095,2.8467409746794026,6.6336423214948797E-3,0.23012543446658185,0.60809451125637926,1.8919770449223208,"n/a","n/a","n/a","n/a","n/a","n/a","n/a","n/a","n/a","n/a","n/a","n/a",0,1.043486550719928,23.5]
[4.3294568113945749E-7,54.700595374062424,2.8356760529683571,6.6403215163670258E-3,0.2308962230527663,0.61398565351208767,1.894946330127163,"n/a","n/a","n/a","n/a","n/a","n/a","n/a","n/a","n/a","n/a","n/a","n/a",0,1.0515216040261501,23.75]
[4.3068485273027085E-7,54.808097075366682,2.8245630584786277,6.6465224478637897E-3,0.23165302319762218,0.61980995708313469,1.8978819639062201,"n/a","n/a","n/a","n/a","n/a","n/a","n/a","n/a","n/a","n/a","n/a","n/a",0,1.0594600516942512,24]
[4.2845907631745598E-7,54.916704265888036,2.8134019912102133,6.6522451159851705E-3,0.23239591015510136,0.62556591194589972,1.90078461300039,"n/a","n/a","n/a","n/a","n/a","n/a","n/a","n/a","n/a","n/a","n/a","n/a",0,1.0673004820929375,24.25]
[4.262674554166564E-7,55.026431665210559,2.8021928511631149,6.6574895207311708E-3,0.23312495571984868,0.63125201882298843,1.9036549251638726,"n/a","n/a","n/a","n/a","n/a","n/a","n/a","n/a","n/a","n/a","n/a","n/a",0,1.075041488957688,24.5]
[4.2410912531826708E-7,55.137294285921207,2.7909356383373316,6.6622556621017881E-3,0.23384022832476345,0.63686678933253027,1.9064935298705186,"n/a","n/a","n/a","n/a","n/a","n/a","n/a","n/a","n/a","n/a","n/a","n/a",0,1.0826816716571366,24.75]
[4.2198325165395286E-7,55.249307440996489,2.7796303527328643,6.6665435400970249E-3,0.23454179313353793,0.64240874613896248,1.9093010389877376,"n/a","n/a","n/a","n/a","n/a","n/a","n/a","n/a","n/a","n/a","n/a","n/a",0,1.0902196354548734,25]
[4.1988902904142405E-7,55.362486751419013,2.7682769943497121,6.6703531547168786E-3,0.23522971212842955,0.64787642310532556,1.9120780474197403,"n/a","n/a","n/a","n/a","n/a","n/a","n/a","n/a","n/a","n/a","n/a","n/a",0,1.0976539917669608,25.25]
[4.1782567980246909E-7,55.47684815403229,2.7568755631878759,6.6736845059613518E-3,0.23590404419350702,0.65326836544711298,1.9148251337217705,"n/a","n/a","n/a","n/a","n/a","n/a","n/a","n/a","n/a","n/a","n/a","n/a",0,1.1049833584154516,25.5]
[4.1579245274961065E-7,55.592407909642645,2.7454260592473552,6.676537593830442E-3,0.23656484519359414,0.65858312988770318,1.917542860686883,"n/a","n/a","n/a","n/a","n/a","n/a","n/a","n/a","n/a","n/a","n/a","n/a",0,1.1122063598781773,25.75]
[4.1378862203708472E-7,55.709182611377713,2.73392848252815,6.6789124183241509E-3,0.23721216804912013,0.66381928481541341,1.9202317759067271,"n/a","n/a","n/a","n/a","n/a","n/a","n/a","n/a","n/a","n/a","n/a","n/a",0,1.1193216275350604,26]
[4.1181348607215188E-7,55.827189193310652,2.7223828330302604,6.6808089794424784E-3,0.23784606280707218,0.66897541044221187,1.9228924123077067,"n/a","n/a","n/a","n/a","n/a","n/a","n/a","n/a","n/a","n/a","n/a","n/a",0,1.1263277999111931,26.25]
[4.0986636648303208E-7,55.94644493936066,2.7107891107536863,6.6822272771854237E-3,0.23846657670823249,0.67405009896412471,1.9255252886637986,"n/a","n/a","n/a","n/a","n/a","n/a","n/a","n/a","n/a","n/a","n/a","n/a",0,1.1332235229169119,26.5]
[4.0794660714001515E-7,56.06696749247989,2.6991473156984278,6.6831673115529868E-3,0.23907375425087099,0.67904195472337858,1.9281309100872424,"n/a","n/a","n/a","n/a","n/a","n/a","n/a","n/a","n/a","n/a","n/a","n/a",0,1.1400074500850841,26.75]
[4.0605357322653881E-7,56.188774864137883,2.6874574478644848,6.6836290825451677E-3,0.23966763725105303,0.68394959437231939,1.9307097684982304,"n/a","n/a","n/a","n/a","n/a","n/a","n/a","n/a","n/a","n/a","n/a","n/a",0,1.1466782428058178,27]
[4.04186650357248E-7,56.311885444114964,2.6757195072518574,6.6836125901619673E-3,0.24024826489971121,0.68877164703914495,1.933262343074674,"n/a","n/a","n/a","n/a","n/a","n/a","n/a","n/a","n/a","n/a","n/a","n/a",0,1.1532345705587856,27.25]
[4.0234524374025227E-7,56.436318010616404,2.6639334938605459,6.6831178344033855E-3,0.2408156738166212,0.69350675449549881,1.935789100683045,"n/a","n/a","n/a","n/a","n/a","n/a","n/a","n/a","n/a","n/a","n/a","n/a",0,1.1596751111433574,27.5]
[4.0052877738098834E-7,56.562091740720078,2.6520994076905495,6.6821448152694215E-3,0.2413698981014116,0.69815357132596423,1.9382904962912422,"n/a","n/a","n/a","n/a","n/a","n/a","n/a","n/a","n/a","n/a","n/a","n/a",0,1.1659985509067159,27.75]
[3.9873669332526606E-7,56.68922622117028,2.6402172487418691,6.6806935327600753E-3,0.24191096938173037,0.70271076509950858,1.9407669733643731,"n/a","n/a","n/a","n/a","n/a","n/a","n/a","n/a","n/a","n/a","n/a","n/a",0,1.1722035849701311,28]
[3.9696845093924061E-7,56.817741459531824,2.6282870170145038,6.6787639868753478E-3,0.24243891685868063,0.70717701654291776,1.9432189642442914,"n/a","n/a","n/a","n/a","n/a","n/a","n/a","n/a","n/a","n/a","n/a","n/a",0,1.1782889174535511,28.25]
[3.9522352622419966E-7,56.947657895718166,2.6163087125084545,6.6763561776152381E-3,0.24295376734963425,0.71155101971627444,1.945646890513685,"n/a","n/a","n/a","n/a","n/a","n/a","n/a","n/a","n/a","n/a","n/a","n/a",0,1.1842532616986756,28.5]
[3.9350141116419337E-7,57.078996413908953,2.6042823352237203,6.6734701049797479E-3,0.24345554532852054,0.7158314821905255,1.9480511633454585,"n/a","n/a","n/a","n/a","n/a","n/a","n/a","n/a","n/a","n/a","n/a","n/a",0,1.1900953404906529,28.75]
[3.9180161310466387E-7,57.211778354872152,2.5922078851603025,6.6701057689688738E-3,0.24394427296368459,0.72001712522718919,1.9504321838381196,"n/a","n/a","n/a","n/a","n/a","n/a","n/a","n/a","n/a","n/a","n/a","n/a",0,1.1958138862785508,29]
[3.9012365416034654E-7,57.346025528707422,2.5800853623181998,6.6662631695826192E-3,0.24441997015340067,0.72410668396025846,1.9527903433378344,"n/a","n/a","n/a","n/a","n/a","n/a","n/a","n/a","n/a","n/a","n/a","n/a",0,1.201407641394741,29.25]
[3.8846707065082973E-7,57.48176022802771,2.5679147666974123,6.6619423068209824E-3,0.24488265455912181,0.72809890758034357,1.955126023747781,"n/a","n/a","n/a","n/a","n/a","n/a","n/a","n/a","n/a","n/a","n/a","n/a",0,1.2068753582733209,29.5]
[3.8683141256225604E-7,57.619005241596881,2.5556960982979406,6.6571431806839634E-3,0.24533234163654088,0.73199255952112352,1.957439597825398,"n/a","n/a","n/a","n/a","n/a","n/a","n/a","n/a","n/a","n/a","n/a","n/a",0,1.2122157996677172,29.75]
[3.8521624303374869E-7,57.75778386844226,2.543429357119785,6.6518657911715622E-3,0.24576904466453262,0.73578641764815045,1.9597314294680932,"n/a","n/a","n/a","n/a","n/a","n/a","n/a","n/a","n/a","n/a","n/a","n/a",0,1.2174277388675825,30]

{"sheet":"Material References","index":1,"n_rows":24,"n_cols":4,"rows_kept":24,"cut":false,"hidden":false,"merged":[]}
[]
[null,"Megtron 6","Dk","Df"]
[null,100000000,3.67,3.8999999999999998E-3]
[null,1000000000,3.65,4.0000000000000001E-3]
[null,2000000000,3.59,4.3E-3]
[null,5000000000,3.5760000000000001,4.8999999999999998E-3]
[null,10000000000,3.3494000000000002,5.4999999999999997E-3]
[null,20000000000,3,6.4999999999999997E-3]
[]
[null,"Nelco 4000-13SI","Dk","Df"]
[null,100000000,3.6,9.1999999999999998E-3]
[null,1000000000,3.52,1.15E-2]
[null,2000000000,3.49,1.0800000000000001E-2]
[null,5000000000,3.46,1.0999999999999999E-2]
[null,10000000000,3.44,1.12E-2]
[null,20000000000,3.43,1.14E-2]
[]
[null,"Improved FR4","Dk","Df"]
[null,100000000,3.6,9.1999999999999998E-3]
[null,1000000000,3.6,9.1999999999999998E-3]
[null,2000000000,3.5,1.15E-2]
[null,5000000000,3.5,1.15E-2]
[null,10000000000,3.4,1.2500000000000001E-2]
[null,20000000000,3.2,1.4E-2]

{"sheet":"KR Spec","index":2,"n_rows":129,"n_cols":12,"rows_kept":129,"cut":false,"hidden":false,"merged":[[2,0,2,3]]}
["b1",2.0000000000000002E-5,"b2",1.0999999999999999E-10,"b3",3.1999999999999997E-20,"b4",-1.1999999999999999E-30]
["F1",1000000000,"F2",6000000000,"Fa",100000000,"Fb",5156250000,"fmin",50000000,"fmax",15000000000]
["KR MAXIMUM INSERTION LOSS"]
["Freq","Freq (GHz)","Fitted Attenuation","Insertion Loss"]
[10000000,{"$f":"A5*0.000000001","v":0.01},{"$f":"20 * LOG(EXP(1)) * ($B$1*SQRT(A5) + $D$1*A5 + $F$1*(A5^2) + $H$1*(A5^3))","v":0.55892615824846736},{"$f":" IF(A5<$J$2,,IF(A5<$D$2,C5+0.8+0.0000000002*A5,IF(A5<$L$2,C5+0.8+0.0000000002*$D$2+0.00000001*(A5-$D$2),)))","v":0}]
[50000000,{"$f":"A6*0.000000001","v":0.05},{"$f":"20 * LOG(EXP(1)) * ($B$1*SQRT(A6) + $D$1*A6 + $F$1*(A6^2) + $H$1*(A6^3))","v":1.276836254039708},2.0868362540397078]
[100000000,0.1,1.835491775248338,2.655491775248338]
[150000000,0.15000000000000002,2.2771355992531457,3.1071355992531458]
[200000000,0.2,2.6588647117191306,3.4988647117191309]
[250000000,0.25,3.0027903600063128,3.8527903600063125]
[500000000,0.5,4.4303560989072821,5.3303560989072816]
[750000000,0.75,5.6259923637648699,6.5759923637648701]
[1000000000,1,6.7164122132677724,7.7164122132677724]
[1250000000,1.25,7.7500982170117352,8.800098217011735]
[1500000000,1.5,8.7514391742315407,9.8514391742315421]
[1750000000,1.75,9.734526467178636,10.884526467178636]
[2000000000,2,10.708200923830994,11.908200923830995]
[2250000000,2.25,11.678304981139654,12.928304981139654]
[2500000000,2.5,12.648826785432208,13.948826785432209]
[2750000000,2.75,13.622537581278499,14.9725375812785]
[3000000000,3,14.601372345588093,16.001372345588095]
[3250000000,3.25,15.586669787441192,17.036669787441191]
[3500000000,3.5,16.579330444096289,18.079330444096289]
[3750000000,3.7500000000000004,17.579924646865791,19.129924646865792]
[4000000000,4,18.588768515690948,20.188768515690949]
[4250000000,4.25,19.605978844460164,21.255978844460166]
[4500000000,4.5,20.631513629850605,22.331513629850605]
[4750000000,4.75,21.665202582942914,23.415202582942914]
[5000000000,5,22.706770493105555,24.506770493105556]
[5250000000,5.25,23.755855390018517,25.605855390018519]
[5500000000,5.5,24.812022853016185,26.712022853016187]
[5750000000,5.75,25.874777421900152,27.824777421900151]
[6000000000,6,26.943571796075975,28.943571796075975]
[6250000000,6.25,28.017814324419682,32.517814324419682]
[6500000000,6.5,29.096875158727283,36.096875158727286]
[6750000000,6.75,30.180091351129786,39.680091351129789]
[7000000000,7,31.266771108879578,43.266771108879581]
[7250000000,7.2500000000000009,32.356197370745974,46.856197370745974]
[7500000000,7.5000000000000009,33.447630832714978,50.447630832714978]
[7750000000,7.7500000000000009,34.540312523218304,54.040312523218304]
[8000000000,8,35.633466007246838,57.633466007246838]
[8250000000,8.25,36.726299282694342,61.226299282694342]
[8500000000,8.5,37.818006419881186,64.818006419881186]
[8750000000,8.75,38.907768985530851,68.407768985530851]
[9000000000,9,39.994757284854309,71.994757284854302]
[9250000000,9.25,41.078131449358466,75.578131449358466]
[9500000000,9.5,42.157042393171992,79.157042393171992]
[9750000000,9.75,43.230632656805973,82.730632656805966]
[10000000000,10,44.298037154131677,86.298037154131677]
[10250000000,10.25,45.358383835807821,89.858383835807814]
[10500000000,10.5,46.410794280302731,93.410794280302724]
[10750000000,10.75,47.454384221941979,96.954384221941979]
[11000000000,11,48.488264023993132,100.48826402399314]
[11250000000,11.25,49.511539103622468,104.01153910362247]
[11500000000,11.5,50.523310314575745,107.52331031457575]
[11750000000,11.75,51.52267429261272,111.02267429261272]
[12000000000,12,52.50872376803229,114.5087237680323]
[12250000000,12.25,53.480547849041301,117.9805478490413]
[12500000000,12.5,54.437232279224148,121.43723227922415]
[12750000000,12.75,55.377859671948535,124.87785967194853]
[13000000000,13,56.301509724184058,128.30150972418406]
[13250000000,13.25,57.207259411900473,131.70725941190048]
[13500000000,13.5,58.094183168949641,135.09418316894966]
[13750000000,13.75,58.961353051105398,138.46135305110539]
[14000000000,14,59.807838886739916,141.80783888673992]
[14250000000,14.25,60.632708415442814,145.13270841544281]
[14500000000,14.500000000000002,61.435027415742496,148.4350274157425]
[14750000000,14.750000000000002,62.213859822958099,151.71385982295811]
[15000000000,15.000000000000002,{"$f":"20 * LOG(EXP(1)) * ($B$1*SQRT(A69) + $D$1*A69 + $F$1*(A69^2) + $H$1*(A69^3))","v":62.968267838099166},{"$f":" IF(A69<$J$2,,IF(A69<$D$2,C69+0.8+0.0000000002*A69,IF(A69<$L$2,C69+0.8+0.0000000002*$D$2+0.00000001*(A69-$D$2),)))","v":0}]
[15250000000,{"$f":"A70*0.000000001","v":15.250000000000002},63.697312028630044,0]
[15500000000,15.500000000000002,64.400051421829644,0]
[15750000000,15.750000000000002,65.075543591401171,0]
[16000000000,16,65.722844737918834,0]
[16250000000,16.25,66.341009763639107,0]
[16500000000,16.5,66.929092342151733,0]
[16750000000,16.75,67.486144983298971,0]
[17000000000,17,68.011219093750185,0]
[17250000000,17.25,68.503365033581701,0]
[17500000000,17.5,68.961632169179694,0]
[17750000000,17.75,69.385068922753618,0]
[18000000000,18,69.772722818722059,0]
[18250000000,18.25,70.123640527209261,0]
[18500000000,18.5,70.436867904868848,0]
[18750000000,18.75,70.711450033233433,0]
[19000000000,19,70.946431254770289,0]
[19250000000,19.25,71.140855206809093,0]
[19500000000,19.5,71.293764853492988,0]
[19750000000,19.75,71.404202515891953,0]
[20000000000,20,71.471209900406237,0]
[20250000000,20.25,71.493828125576485,0]
[20500000000,20.5,71.471097747409488,0]
[20750000000,20.75,71.402058783317628,0]
[21000000000,21,71.285750734764378,0]
[21250000000,21.25,71.121212608700077,0]
[21500000000,21.5,70.907482937866376,0]
[21750000000,21.75,70.643599800040562,0]
[22000000000,22,70.328600836287961,0]
[22250000000,22.25,69.961523268283287,0]
[22500000000,22.5,69.541403914758234,0]
[22750000000,22.75,69.06727920712926,0]
[23000000000,23,68.538185204354789,0]
[23250000000,23.25,67.953157607067098,0]
[23500000000,23.5,67.311231771022477,0]
[23750000000,23.75,66.611442719909235,0]
[24000000000,24,65.852825157550342,0]
[24250000000,24.25,65.034413479535615,0]
[24500000000,24.5,64.155241784315734,0]
[24750000000,24.75,63.21434388378777,0]
[25000000000,25,62.210753313401241,0]
[25250000000,25.25,61.143503341809776,0]
[25500000000,25.5,60.011626980094654,0]
[25750000000,25.75,58.81415699058163,0]
[26000000000,26,57.550125895273915,0]
[26250000000,26.25,56.218565983920996,0]
[26500000000,26.5,54.818509321742233,0]
[26750000000,26.75,53.348987756823838,0]
[27000000000,27,51.809032927205031,0]
[27250000000,27.25,50.197676267669458,0]
[27500000000,27.5,48.513949016257634,0]
[27750000000,27.75,46.756882220512622,0]
[28000000000,28,44.925506743473697,0]
[28250000000,28.25,43.018853269429442,0]
[28500000000,28.5,41.035952309442372,0]
[28750000000,28.750000000000004,38.975834206655612,0]
[29000000000,29.000000000000004,36.837529141393141,0]
[29250000000,29.250000000000004,34.620067136061436,0]
[29500000000,29.500000000000004,32.322478059864331,0]
[29750000000,29.750000000000004,29.943791633336925,0]
[30000000000,30.000000000000004,27.483037432709853,0]